{"text_format":"1","workbook":"xlsx","n_sheets":9,"sheets":["forside","license","db_LCA","db_LCA50","db_LCA80","diagram","menuer","beregning","andel bygningsdele"],"not_rendered":{"charts":4,"images":0,"macros":1,"external_links":0,"defined_names":30,"comments":0,"pivot_tables":0},"unopened":[],"bounds":{"document_bytes":16777216,"sheet_cells":100000,"rows_first":2000,"rows_last":500,"rows_between":2000,"halvings":0,"cell_chars":16384,"cell_head_chars":4096},"cells_cut":0,"cells_raw":0,"read":"whole","date_system":"1900"}

{"sheet":"forside","index":0,"n_rows":51,"n_cols":8,"rows_kept":51,"cut":false,"hidden":false,"merged":[[8,4,8,5],[9,4,9,5],[46,1,46,2]]}
[]
[]
[]
[null,"LCAestimator"]
[null,"vandkunsten 2020"]
[]
[]
[]
[null,"bygning: ","min bygning",null,"optional"]
[null,"byggeår:",2014,null,"optional"]
[null,"bygningens bruttoareal:",3000,"m2"]
[null,"betragtningsperiode",80,"år"]
[]
[null,"bygningsdele","primært materiale",null,"sekundært materiale (optinal)"]
[null,"fundament","beton/cement",null,"vælg materialet","optional"]
[null,"terrændæk","beton/cement",null,"vælg materialet","optional"]
[null,"dæk","træ",null,"vælg materialet","optional"]
[null,"bærende konstruktion","træ",null,"vælg materialet","optional"]
[null,"ydervægge, overflade","træ",null,"vælg materialet","optional"]
[null,"indervægge","træ",null,"vælg materialet","optional"]
[null,"vinduer","træ",null,"vælg materialet","optional"]
[null,"tag, bærende konstruktion","træ",null,"vælg materialet","optional"]
[null,"tag, overflade","metal",null,"vælg materialet","optional"]
[]
[]
[null,"beregn miljøpåvirkning",null,null,null,null,null,{"$f":"v_navn & \" i forhold til '60 cases' (SBI2020:04)\"","v":"min bygning i forhold til '60 cases' (SBI2020:04)"}]
[]
[null,"vælg påvirkningskategori","GWP"]
[null,"antaget miljøpåvirkning:*",{"$f":"_xlfn.XLOOKUP(category,beregning!$T$7:$T$15,beregning!U$7:U$15,\"-\")","v":4.4437447464635573},{"$f":"_xlfn.XLOOKUP(category,menuer!J$5:J$13,menuer!L$5:L$13,\"\") &\" \"& _xlfn.XLOOKUP(category,menuer!J$5:J$13,menuer!K$5:K$13,\"\") &\" /m2/år\"","v":"kg CO2eq  /m2/år"}]
[null,null,{"$f":"_xlfn.XLOOKUP(category,beregning!$T$7:$T$15,beregning!W$7:W$15,\"-\")","v":13.331234239390673},{"$f":"_xlfn.XLOOKUP(category,menuer!J$5:J$13,menuer!M$5:M$13,\"\") &\" \"& _xlfn.XLOOKUP(category,menuer!J$5:J$13,menuer!K$5:K$13,\"\") &\" /år\"","v":"tons CO2eq  /år"}]
[null,null,{"$f":"_xlfn.XLOOKUP(category,beregning!$T$7:$T$15,beregning!X$7:X$15,\"-\")","v":1066.4987391512539},{"$f":"_xlfn.XLOOKUP(category,menuer!J$5:J$13,menuer!M$5:M$13,\"\") &\" \"& _xlfn.XLOOKUP(category,menuer!J$5:J$13,menuer!K$5:K$13,\"\") &\" / \"&aar&\"år\"","v":"tons CO2eq  / 80år"}]
[]
[null,"varians/skævhed**",{"$f":"beregning!J7","v":0.45423929642821126}]
[null,null,null,null,null,null,null,{"$f":"v_navn & \" i forhold til de 3 bedste matches fra databasen\"","v":"min bygning i forhold til de 3 bedste matches fra databasen"}]
[]
[null,"bedste match***",{"$f":"beregning!C7","v":"E07"}]
[null,"miljøpåvirkning bedste match",{"$f":"_xlfn.XLOOKUP(category,beregning!$T$7:$T$15,beregning!Z$7:Z$15,\"-\")","v":3.8},{"$f":"_xlfn.XLOOKUP(category,menuer!J$5:J$13,menuer!L$5:L$13,\"\") &\" \"& _xlfn.XLOOKUP(category,menuer!J$5:J$13,menuer!K$5:K$13,\"\") &\" /m2/år\"","v":"kg CO2eq  /m2/år"}]
[null,null,{"$f":"_xlfn.XLOOKUP(category,beregning!$T$7:$T$15,beregning!AB$7:AB$15,\"-\")","v":11.4},{"$f":"_xlfn.XLOOKUP(category,menuer!J$5:J$13,menuer!M$5:M$13,\"\") &\" \"& _xlfn.XLOOKUP(category,menuer!J$5:J$13,menuer!K$5:K$13,\"\") &\" /år\"","v":"tons CO2eq  /år"}]
[null,null,{"$f":"_xlfn.XLOOKUP(category,beregning!$T$7:$T$15,beregning!AC$7:AC$15,\"-\")","v":912},{"$f":"_xlfn.XLOOKUP(category,menuer!J$5:J$13,menuer!M$5:M$13,\"\") &\" \"& _xlfn.XLOOKUP(category,menuer!J$5:J$13,menuer!K$5:K$13,\"\") &\" / \"&aar&\"år\"","v":"tons CO2eq  / 80år"}]
[]
[null,"varians/skævhed bedste match",{"$f":"beregning!J8","v":0}]
[null,null,null,null,null,null,null,{"$f":"v_navn&\" / andel bygningsdele ***\"","v":"min bygning / andel bygningsdele ***"}]
[]
[]
[null,"*alle LCA-data stammer fra SBI rapport 2020:04 (\"60 cases\")"]
[null,"link: https://sbi.dk/Assets/Klimapaavirkning-fra-60-bygninger/SBi-2020-04.pdf\n\n"]
[null,"** \"skævhed\" udtrykker hvor nøjagtigt resultatet kan være. En lav skævhed er udtryk for en bedre match mellem de indtastede data og databasen."]
[]
[null,"*** se SBI-rapport 2020_04"]
[]
[null,"data for bygningdele og materialer kan for eksisterende byggeri findes i BBR-meddelelsen"]

{"sheet":"license","index":1,"n_rows":25,"n_cols":2,"rows_kept":25,"cut":false,"hidden":false,"merged":[]}
[]
[]
[]
[]
[null,"Begin license text."]
[]
[]
[null,"Copyright 2021 / vandkunsten architects (Jan S. Kauschen)"]
[]
[null,"Permission is hereby granted, free of charge, to any person obtaining a copy of this software and associated documentation files (the \"Software\"), to deal in the Software without restriction, including without limitation the rights to use, copy, modify, merge, publish, distribute, sublicense, and/or sell copies of the Software, and to permit persons to whom the Software is furnished to do so, subject to the following conditions:"]
[]
[null,"The above copyright notice and this permission notice shall be included in all copies or substantial portions of the Software."]
[]
[null,"THE SOFTWARE IS PROVIDED \"AS IS\", WITHOUT WARRANTY OF ANY KIND, EXPRESS OR IMPLIED, INCLUDING BUT NOT LIMITED TO THE WARRANTIES OF MERCHANTABILITY, FITNESS FOR A PARTICULAR PURPOSE AND NONINFRINGEMENT. IN NO EVENT SHALL THE AUTHORS OR COPYRIGHT HOLDERS BE LIABLE FOR ANY CLAIM, DAMAGES OR OTHER LIABILITY, WHETHER IN AN ACTION OF CONTRACT, TORT OR OTHERWISE, ARISING FROM, OUT OF OR IN CONNECTION WITH THE SOFTWARE OR THE USE OR OTHER DEALINGS IN THE SOFTWARE."]
[]
[]
[]
[null,"End license text."]
[]
[]
[]
[]
[]
[null,"to see all sheets or get access to the formuals, use the password \"vandkunsten\""]
[null,"the sheet is locked only to prohibit errors that usually happen when formuals are accessible i cells"]

{"sheet":"db_LCA","index":2,"n_rows":65,"n_cols":50,"rows_kept":65,"cut":false,"hidden":true,"merged":[[1,21,1,22],[2,21,2,22],[3,21,3,22],[2,24,2,25],[2,27,2,28],[2,45,2,46],[2,30,2,31],[2,33,2,34],[2,36,2,37],[2,39,2,40],[2,42,2,43]]}
[1,2,3,4,5,6,7,8,9,10,11,12,13,14,15,16,17,18,19,20,21,22,23,null,24,25,null,26,27,null,28,29,null,30,31,null,32,33,null,34,35,null,36,37,null,38,39,40,41,42]
[null,null,null,null,"type",null,null,null,null,null,null,null,null,null,null,null,null,null,null,null,null,"GWP",null,null,"ODP",null,null,"AP",null,null,"EP",null,null,"POCP",null,null,"ADPe",null,null,"ADPf",null,null,"Petot",null,null,"Sek"]
[null,null,null,null,null,null,null,null,null,null,null,null,null,null,null,null,null,null,null,null,null,"A1-3, B4, C3-4",null,null,"A1-3, B4, C3-4",null,null,"A1-3, B4, C3-4",null,null,"A1-3, B4, C3-4",null,null,"A1-3, B4, C3-4",null,null,"A1-3, B4, C3-4",null,null,"A1-3, B4, C3-4",null,null,"A1-3, B4, C3-4",null,null,"A1-3, B4, C3-4"]
[null,null,null,null,null,null,null,null,null,null,null,null,null,null,null,null,null,null,null,null,null,"kg CO2eq/m2",null,null,"kg R11eq/m2",null,null,"kg SO2eq/m2",null,null,"kg PO4eq/m2",null,null,"kg ethen eq/m2",null,null,"kg Sb eq/m2",null,null,"MJ/m2",null,null,"kWh/m2",null,null,"kWh/m2"]
[null,null,null,"størrelse","fundament","terrændæk","terrændæk","dæk","dæk","ydervægge, bærende konstruktion","ydervægge, bærende konstruktion","ydervægge, overflade","ydervægge, overflade","indervægge","indervægge","vinduer","vinduer","tag, bærende konstruktion","tag, bærende konstruktion","tag, overfalde","tag, overfalde","50 år","80år",null,"50 år","80år",null,"50 år","80år",null,"50 år","80år",null,"50 år","80år",null,"50 år","80år",null,"50 år","80år",null,"50 år","80år",null,"50 år","80år"]
["A05",null,null,"stor","beton/cement","beton/cement",null,"beton/cement",null,"beton/cement",null,"metal",null,"beton/cement",null,"metal",null,"beton/cement",null,"tagpap",null,{"$f":"_xlfn.XLOOKUP($A6,db_LCA50!$A:$A,db_LCA50!C:C)","v":6.62},{"$f":"_xlfn.XLOOKUP($A6,db_LCA80!$A:$A,db_LCA80!C:C)","v":5.66},null,{"$f":"_xlfn.XLOOKUP($A6,db_LCA50!$A:$A,db_LCA50!F:F)","v":2.6400000000000001E-8},{"$f":"_xlfn.XLOOKUP($A6,db_LCA80!$A:$A,db_LCA80!F:F)","v":2.1299999999999999E-8},null,{"$f":"_xlfn.XLOOKUP($A6,db_LCA50!$A:$A,db_LCA50!I:I)","v":2.1399999999999999E-2},{"$f":"_xlfn.XLOOKUP($A6,db_LCA80!$A:$A,db_LCA80!I:I)","v":1.8800000000000001E-2},null,{"$f":"_xlfn.XLOOKUP($A6,db_LCA50!$A:$A,db_LCA50!L:L)","v":2.8500000000000001E-3},{"$f":"_xlfn.XLOOKUP($A6,db_LCA80!$A:$A,db_LCA80!L:L)","v":2.4599999999999999E-3},null,{"$f":"_xlfn.XLOOKUP($A6,db_LCA50!$A:$A,db_LCA50!O:O)","v":2.5500000000000002E-3},{"$f":"_xlfn.XLOOKUP($A6,db_LCA80!$A:$A,db_LCA80!O:O)","v":2.2000000000000001E-3},null,{"$f":"_xlfn.XLOOKUP($A6,db_LCA50!$A:$A,db_LCA50!R:R)","v":2.81E-4},{"$f":"_xlfn.XLOOKUP($A6,db_LCA80!$A:$A,db_LCA80!R:R)","v":2.5999999999999998E-4},null,{"$f":"_xlfn.XLOOKUP($A6,db_LCA50!$A:$A,db_LCA50!U:U)","v":71.8},{"$f":"_xlfn.XLOOKUP($A6,db_LCA80!$A:$A,db_LCA80!U:U)","v":63.5},null,{"$f":"_xlfn.XLOOKUP($A6,db_LCA50!$A:$A,db_LCA50!X:X)","v":30},{"$f":"_xlfn.XLOOKUP($A6,db_LCA80!$A:$A,db_LCA80!X:X)","v":25.9},null,{"$f":"_xlfn.XLOOKUP($A6,db_LCA50!$A:$A,db_LCA50!AA:AA)","v":0.56899999999999995},{"$f":"_xlfn.XLOOKUP($A6,db_LCA80!$A:$A,db_LCA80!AA:AA)","v":0.35699999999999998}]
["A06",null,null,"stor","beton/cement","beton/cement",null,"beton/cement",null,"metal",null,"metal",null,"beton/cement",null,"metal",null,"beton/cement",null,"tagpap",null,{"$f":"_xlfn.XLOOKUP(A7,db_LCA50!A:A,db_LCA50!C:C)","v":6.25},{"$f":"_xlfn.XLOOKUP($A7,db_LCA80!$A:$A,db_LCA80!C:C)","v":5.48},null,{"$f":"_xlfn.XLOOKUP($A7,db_LCA50!$A:$A,db_LCA50!F:F)","v":2.66E-8},{"$f":"_xlfn.XLOOKUP($A7,db_LCA80!$A:$A,db_LCA80!F:F)","v":2.0400000000000001E-8},null,{"$f":"_xlfn.XLOOKUP($A7,db_LCA50!$A:$A,db_LCA50!I:I)","v":2.0400000000000001E-2},{"$f":"_xlfn.XLOOKUP($A7,db_LCA80!$A:$A,db_LCA80!I:I)","v":1.83E-2},null,{"$f":"_xlfn.XLOOKUP($A7,db_LCA50!$A:$A,db_LCA50!L:L)","v":2.8800000000000002E-3},{"$f":"_xlfn.XLOOKUP($A7,db_LCA80!$A:$A,db_LCA80!L:L)","v":2.5400000000000002E-3},null,{"$f":"_xlfn.XLOOKUP($A7,db_LCA50!$A:$A,db_LCA50!O:O)","v":2.4399999999999999E-3},{"$f":"_xlfn.XLOOKUP($A7,db_LCA80!$A:$A,db_LCA80!O:O)","v":2.14E-3},null,{"$f":"_xlfn.XLOOKUP($A7,db_LCA50!$A:$A,db_LCA50!R:R)","v":2.81E-4},{"$f":"_xlfn.XLOOKUP($A7,db_LCA80!$A:$A,db_LCA80!R:R)","v":2.5999999999999998E-4},null,{"$f":"_xlfn.XLOOKUP($A7,db_LCA50!$A:$A,db_LCA50!U:U)","v":71.7},{"$f":"_xlfn.XLOOKUP($A7,db_LCA80!$A:$A,db_LCA80!U:U)","v":65.599999999999994},null,{"$f":"_xlfn.XLOOKUP($A7,db_LCA50!$A:$A,db_LCA50!X:X)","v":33.200000000000003},{"$f":"_xlfn.XLOOKUP($A7,db_LCA80!$A:$A,db_LCA80!X:X)","v":30.5},null,{"$f":"_xlfn.XLOOKUP($A7,db_LCA50!$A:$A,db_LCA50!AA:AA)","v":0.42899999999999999},{"$f":"_xlfn.XLOOKUP($A7,db_LCA80!$A:$A,db_LCA80!AA:AA)","v":0.26900000000000002}]
["A07",null,null,"mellem","beton/cement","beton/cement",null,"beton/cement",null,"beton/cement",null,"metal",null,"beton/cement",null,"træ","metal","beton/cement",null,"tagpap",null,{"$f":"_xlfn.XLOOKUP(A8,db_LCA50!A:A,db_LCA50!C:C)","v":10.1},{"$f":"_xlfn.XLOOKUP($A8,db_LCA80!$A:$A,db_LCA80!C:C)","v":7.24},null,{"$f":"_xlfn.XLOOKUP($A8,db_LCA50!$A:$A,db_LCA50!F:F)","v":1.3399999999999999E-8},{"$f":"_xlfn.XLOOKUP($A8,db_LCA80!$A:$A,db_LCA80!F:F)","v":1E-8},null,{"$f":"_xlfn.XLOOKUP($A8,db_LCA50!$A:$A,db_LCA50!I:I)","v":2.9700000000000001E-2},{"$f":"_xlfn.XLOOKUP($A8,db_LCA80!$A:$A,db_LCA80!I:I)","v":2.1700000000000001E-2},null,{"$f":"_xlfn.XLOOKUP($A8,db_LCA50!$A:$A,db_LCA50!L:L)","v":3.0599999999999998E-3},{"$f":"_xlfn.XLOOKUP($A8,db_LCA80!$A:$A,db_LCA80!L:L)","v":2.3900000000000002E-3},null,{"$f":"_xlfn.XLOOKUP($A8,db_LCA50!$A:$A,db_LCA50!O:O)","v":3.79E-3},{"$f":"_xlfn.XLOOKUP($A8,db_LCA80!$A:$A,db_LCA80!O:O)","v":2.6900000000000001E-3},null,{"$f":"_xlfn.XLOOKUP($A8,db_LCA50!$A:$A,db_LCA50!R:R)","v":7.2000000000000002E-5},{"$f":"_xlfn.XLOOKUP($A8,db_LCA80!$A:$A,db_LCA80!R:R)","v":6.6199999999999996E-5},null,{"$f":"_xlfn.XLOOKUP($A8,db_LCA50!$A:$A,db_LCA50!U:U)","v":94.8},{"$f":"_xlfn.XLOOKUP($A8,db_LCA80!$A:$A,db_LCA80!U:U)","v":69.8},null,{"$f":"_xlfn.XLOOKUP($A8,db_LCA50!$A:$A,db_LCA50!X:X)","v":37.200000000000003},{"$f":"_xlfn.XLOOKUP($A8,db_LCA80!$A:$A,db_LCA80!X:X)","v":27.4},null,{"$f":"_xlfn.XLOOKUP($A8,db_LCA50!$A:$A,db_LCA50!AA:AA)","v":1.47},{"$f":"_xlfn.XLOOKUP($A8,db_LCA80!$A:$A,db_LCA80!AA:AA)","v":0.92400000000000004}]
["A08",null,null,"stor","beton/cement","beton/cement",null,"beton/cement",null,"beton/cement",null,"tegl",null,"beton/cement","metal","metal",null,"beton/cement",null,"tagpap",null,{"$f":"_xlfn.XLOOKUP(A9,db_LCA50!A:A,db_LCA50!C:C)","v":7.61},{"$f":"_xlfn.XLOOKUP($A9,db_LCA80!$A:$A,db_LCA80!C:C)","v":6.05},null,{"$f":"_xlfn.XLOOKUP($A9,db_LCA50!$A:$A,db_LCA50!F:F)","v":1.05E-8},{"$f":"_xlfn.XLOOKUP($A9,db_LCA80!$A:$A,db_LCA80!F:F)","v":7.3600000000000002E-9},null,{"$f":"_xlfn.XLOOKUP($A9,db_LCA50!$A:$A,db_LCA50!I:I)","v":1.9599999999999999E-2},{"$f":"_xlfn.XLOOKUP($A9,db_LCA80!$A:$A,db_LCA80!I:I)","v":1.66E-2},null,{"$f":"_xlfn.XLOOKUP($A9,db_LCA50!$A:$A,db_LCA50!L:L)","v":2.5400000000000002E-3},{"$f":"_xlfn.XLOOKUP($A9,db_LCA80!$A:$A,db_LCA80!L:L)","v":2.1900000000000001E-3},null,{"$f":"_xlfn.XLOOKUP($A9,db_LCA50!$A:$A,db_LCA50!O:O)","v":2.8500000000000001E-3},{"$f":"_xlfn.XLOOKUP($A9,db_LCA80!$A:$A,db_LCA80!O:O)","v":2.1900000000000001E-3},null,{"$f":"_xlfn.XLOOKUP($A9,db_LCA50!$A:$A,db_LCA50!R:R)","v":9.2499999999999999E-5},{"$f":"_xlfn.XLOOKUP($A9,db_LCA80!$A:$A,db_LCA80!R:R)","v":8.8300000000000005E-5},null,{"$f":"_xlfn.XLOOKUP($A9,db_LCA50!$A:$A,db_LCA50!U:U)","v":69.099999999999994},{"$f":"_xlfn.XLOOKUP($A9,db_LCA80!$A:$A,db_LCA80!U:U)","v":58.5},null,{"$f":"_xlfn.XLOOKUP($A9,db_LCA50!$A:$A,db_LCA50!X:X)","v":24.1},{"$f":"_xlfn.XLOOKUP($A9,db_LCA80!$A:$A,db_LCA80!X:X)","v":20.399999999999999},null,{"$f":"_xlfn.XLOOKUP($A9,db_LCA50!$A:$A,db_LCA50!AA:AA)","v":1.73},{"$f":"_xlfn.XLOOKUP($A9,db_LCA80!$A:$A,db_LCA80!AA:AA)","v":1.1000000000000001}]
["K01",null,null,"mellem","beton/cement","beton/cement",null,"beton/cement",null,"metal",null,"beton/cement",null,"beton/cement","træ","træ","metal","beton/cement","metal","tagpap",null,{"$f":"_xlfn.XLOOKUP(A10,db_LCA50!A:A,db_LCA50!C:C)","v":7.14},{"$f":"_xlfn.XLOOKUP($A10,db_LCA80!$A:$A,db_LCA80!C:C)","v":6.14},null,{"$f":"_xlfn.XLOOKUP($A10,db_LCA50!$A:$A,db_LCA50!F:F)","v":8.6200000000000004E-9},{"$f":"_xlfn.XLOOKUP($A10,db_LCA80!$A:$A,db_LCA80!F:F)","v":5.6299999999999998E-9},null,{"$f":"_xlfn.XLOOKUP($A10,db_LCA50!$A:$A,db_LCA50!I:I)","v":2.0899999999999998E-2},{"$f":"_xlfn.XLOOKUP($A10,db_LCA80!$A:$A,db_LCA80!I:I)","v":1.8800000000000001E-2},null,{"$f":"_xlfn.XLOOKUP($A10,db_LCA50!$A:$A,db_LCA50!L:L)","v":2.3600000000000001E-3},{"$f":"_xlfn.XLOOKUP($A10,db_LCA80!$A:$A,db_LCA80!L:L)","v":2.0400000000000001E-3},null,{"$f":"_xlfn.XLOOKUP($A10,db_LCA50!$A:$A,db_LCA50!O:O)","v":3.64E-3},{"$f":"_xlfn.XLOOKUP($A10,db_LCA80!$A:$A,db_LCA80!O:O)","v":2.8400000000000001E-3},null,{"$f":"_xlfn.XLOOKUP($A10,db_LCA50!$A:$A,db_LCA50!R:R)","v":3.2200000000000002E-4},{"$f":"_xlfn.XLOOKUP($A10,db_LCA80!$A:$A,db_LCA80!R:R)","v":3.4299999999999999E-4},null,{"$f":"_xlfn.XLOOKUP($A10,db_LCA50!$A:$A,db_LCA50!U:U)","v":67.900000000000006},{"$f":"_xlfn.XLOOKUP($A10,db_LCA80!$A:$A,db_LCA80!U:U)","v":61.5},null,{"$f":"_xlfn.XLOOKUP($A10,db_LCA50!$A:$A,db_LCA50!X:X)","v":24.8},{"$f":"_xlfn.XLOOKUP($A10,db_LCA80!$A:$A,db_LCA80!X:X)","v":22.7},null,{"$f":"_xlfn.XLOOKUP($A10,db_LCA50!$A:$A,db_LCA50!AA:AA)","v":1.1299999999999999},{"$f":"_xlfn.XLOOKUP($A10,db_LCA80!$A:$A,db_LCA80!AA:AA)","v":0.72099999999999997}]
["K02",null,null,"stor","beton/cement","beton/cement",null,"beton/cement",null,"beton/cement",null,"metal",null,"beton/cement","metal","træ","metal","beton/cement",null,"tagpap",null,{"$f":"_xlfn.XLOOKUP(A11,db_LCA50!A:A,db_LCA50!C:C)","v":6.09},{"$f":"_xlfn.XLOOKUP($A11,db_LCA80!$A:$A,db_LCA80!C:C)","v":4.24},null,{"$f":"_xlfn.XLOOKUP($A11,db_LCA50!$A:$A,db_LCA50!F:F)","v":1.15E-8},{"$f":"_xlfn.XLOOKUP($A11,db_LCA80!$A:$A,db_LCA80!F:F)","v":7.3E-9},null,{"$f":"_xlfn.XLOOKUP($A11,db_LCA50!$A:$A,db_LCA50!I:I)","v":1.38E-2},{"$f":"_xlfn.XLOOKUP($A11,db_LCA80!$A:$A,db_LCA80!I:I)","v":1.0200000000000001E-2},null,{"$f":"_xlfn.XLOOKUP($A11,db_LCA50!$A:$A,db_LCA50!L:L)","v":1.7700000000000001E-3},{"$f":"_xlfn.XLOOKUP($A11,db_LCA80!$A:$A,db_LCA80!L:L)","v":1.2999999999999999E-3},null,{"$f":"_xlfn.XLOOKUP($A11,db_LCA50!$A:$A,db_LCA50!O:O)","v":2.5000000000000001E-3},{"$f":"_xlfn.XLOOKUP($A11,db_LCA80!$A:$A,db_LCA80!O:O)","v":1.7899999999999999E-3},null,{"$f":"_xlfn.XLOOKUP($A11,db_LCA50!$A:$A,db_LCA50!R:R)","v":1.1E-4},{"$f":"_xlfn.XLOOKUP($A11,db_LCA80!$A:$A,db_LCA80!R:R)","v":7.8499999999999997E-5},null,{"$f":"_xlfn.XLOOKUP($A11,db_LCA50!$A:$A,db_LCA50!U:U)","v":45.8},{"$f":"_xlfn.XLOOKUP($A11,db_LCA80!$A:$A,db_LCA80!U:U)","v":34.799999999999997},null,{"$f":"_xlfn.XLOOKUP($A11,db_LCA50!$A:$A,db_LCA50!X:X)","v":19.600000000000001},{"$f":"_xlfn.XLOOKUP($A11,db_LCA80!$A:$A,db_LCA80!X:X)","v":14.9},null,{"$f":"_xlfn.XLOOKUP($A11,db_LCA50!$A:$A,db_LCA50!AA:AA)","v":2.25},{"$f":"_xlfn.XLOOKUP($A11,db_LCA80!$A:$A,db_LCA80!AA:AA)","v":1.4}]
["K03",null,null,"mellem","beton/cement","beton/cement",null,"beton/cement",null,"beton/cement",null,"beton/cement","metal","beton/cement","metal","metal",null,"beton/cement",null,"tagpap",null,{"$f":"_xlfn.XLOOKUP(A12,db_LCA50!A:A,db_LCA50!C:C)","v":8.1300000000000008},{"$f":"_xlfn.XLOOKUP($A12,db_LCA80!$A:$A,db_LCA80!C:C)","v":6.95},null,{"$f":"_xlfn.XLOOKUP($A12,db_LCA50!$A:$A,db_LCA50!F:F)","v":6.9800000000000003E-8},{"$f":"_xlfn.XLOOKUP($A12,db_LCA80!$A:$A,db_LCA80!F:F)","v":8.1199999999999999E-8},null,{"$f":"_xlfn.XLOOKUP($A12,db_LCA50!$A:$A,db_LCA50!I:I)","v":2.2100000000000002E-2},{"$f":"_xlfn.XLOOKUP($A12,db_LCA80!$A:$A,db_LCA80!I:I)","v":2.0199999999999999E-2},null,{"$f":"_xlfn.XLOOKUP($A12,db_LCA50!$A:$A,db_LCA50!L:L)","v":2.49E-3},{"$f":"_xlfn.XLOOKUP($A12,db_LCA80!$A:$A,db_LCA80!L:L)","v":2.1800000000000001E-3},null,{"$f":"_xlfn.XLOOKUP($A12,db_LCA50!$A:$A,db_LCA50!O:O)","v":3.0200000000000001E-3},{"$f":"_xlfn.XLOOKUP($A12,db_LCA80!$A:$A,db_LCA80!O:O)","v":2.8700000000000002E-3},null,{"$f":"_xlfn.XLOOKUP($A12,db_LCA50!$A:$A,db_LCA50!R:R)","v":8.1799999999999996E-5},{"$f":"_xlfn.XLOOKUP($A12,db_LCA80!$A:$A,db_LCA80!R:R)","v":7.3499999999999998E-5},null,{"$f":"_xlfn.XLOOKUP($A12,db_LCA50!$A:$A,db_LCA50!U:U)","v":78.599999999999994},{"$f":"_xlfn.XLOOKUP($A12,db_LCA80!$A:$A,db_LCA80!U:U)","v":73},null,{"$f":"_xlfn.XLOOKUP($A12,db_LCA50!$A:$A,db_LCA50!X:X)","v":26.6},{"$f":"_xlfn.XLOOKUP($A12,db_LCA80!$A:$A,db_LCA80!X:X)","v":24.5},null,{"$f":"_xlfn.XLOOKUP($A12,db_LCA50!$A:$A,db_LCA50!AA:AA)","v":1.76},{"$f":"_xlfn.XLOOKUP($A12,db_LCA80!$A:$A,db_LCA80!AA:AA)","v":1.1200000000000001}]
["K04",null,null,"mellem","beton/cement","beton/cement",null,"beton/cement",null,"beton/cement",null,"metal","tegl","beton/cement","metal","metal",null,"beton/cement",null,"tagpap",null,{"$f":"_xlfn.XLOOKUP(A13,db_LCA50!A:A,db_LCA50!C:C)","v":6.68},{"$f":"_xlfn.XLOOKUP($A13,db_LCA80!$A:$A,db_LCA80!C:C)","v":5.33},null,{"$f":"_xlfn.XLOOKUP($A13,db_LCA50!$A:$A,db_LCA50!F:F)","v":1.04E-8},{"$f":"_xlfn.XLOOKUP($A13,db_LCA80!$A:$A,db_LCA80!F:F)","v":8.0399999999999995E-9},null,{"$f":"_xlfn.XLOOKUP($A13,db_LCA50!$A:$A,db_LCA50!I:I)","v":1.44E-2},{"$f":"_xlfn.XLOOKUP($A13,db_LCA80!$A:$A,db_LCA80!I:I)","v":1.2200000000000001E-2},null,{"$f":"_xlfn.XLOOKUP($A13,db_LCA50!$A:$A,db_LCA50!L:L)","v":1.7600000000000001E-3},{"$f":"_xlfn.XLOOKUP($A13,db_LCA80!$A:$A,db_LCA80!L:L)","v":1.41E-3},null,{"$f":"_xlfn.XLOOKUP($A13,db_LCA50!$A:$A,db_LCA50!O:O)","v":4.3600000000000002E-3},{"$f":"_xlfn.XLOOKUP($A13,db_LCA80!$A:$A,db_LCA80!O:O)","v":4.0400000000000002E-3},null,{"$f":"_xlfn.XLOOKUP($A13,db_LCA50!$A:$A,db_LCA50!R:R)","v":3.27},{"$f":"_xlfn.XLOOKUP($A13,db_LCA80!$A:$A,db_LCA80!R:R)","v":4.09},null,{"$f":"_xlfn.XLOOKUP($A13,db_LCA50!$A:$A,db_LCA50!U:U)","v":60.6},{"$f":"_xlfn.XLOOKUP($A13,db_LCA80!$A:$A,db_LCA80!U:U)","v":52.4},null,{"$f":"_xlfn.XLOOKUP($A13,db_LCA50!$A:$A,db_LCA50!X:X)","v":20.399999999999999},{"$f":"_xlfn.XLOOKUP($A13,db_LCA80!$A:$A,db_LCA80!X:X)","v":17.8},null,{"$f":"_xlfn.XLOOKUP($A13,db_LCA50!$A:$A,db_LCA50!AA:AA)","v":1.58},{"$f":"_xlfn.XLOOKUP($A13,db_LCA80!$A:$A,db_LCA80!AA:AA)","v":0.99}]
["K05",null,null,"mellem","beton/cement","beton/cement",null,"beton/cement",null,"beton/cement",null,"tegl",null,"træ",null,"træ","metal","beton/cement",null,"tagpap",null,{"$f":"_xlfn.XLOOKUP(A14,db_LCA50!A:A,db_LCA50!C:C)","v":8.64},{"$f":"_xlfn.XLOOKUP($A14,db_LCA80!$A:$A,db_LCA80!C:C)","v":7.31},null,{"$f":"_xlfn.XLOOKUP($A14,db_LCA50!$A:$A,db_LCA50!F:F)","v":2.2700000000000001E-8},{"$f":"_xlfn.XLOOKUP($A14,db_LCA80!$A:$A,db_LCA80!F:F)","v":1.6700000000000001E-8},null,{"$f":"_xlfn.XLOOKUP($A14,db_LCA50!$A:$A,db_LCA50!I:I)","v":2.81E-2},{"$f":"_xlfn.XLOOKUP($A14,db_LCA80!$A:$A,db_LCA80!I:I)","v":2.4400000000000002E-2},null,{"$f":"_xlfn.XLOOKUP($A14,db_LCA50!$A:$A,db_LCA50!L:L)","v":3.2499999999999999E-3},{"$f":"_xlfn.XLOOKUP($A14,db_LCA80!$A:$A,db_LCA80!L:L)","v":2.8900000000000002E-3},null,{"$f":"_xlfn.XLOOKUP($A14,db_LCA50!$A:$A,db_LCA50!O:O)","v":3.0100000000000001E-3},{"$f":"_xlfn.XLOOKUP($A14,db_LCA80!$A:$A,db_LCA80!O:O)","v":2.5500000000000002E-3},null,{"$f":"_xlfn.XLOOKUP($A14,db_LCA50!$A:$A,db_LCA50!R:R)","v":2.8499999999999999E-4},{"$f":"_xlfn.XLOOKUP($A14,db_LCA80!$A:$A,db_LCA80!R:R)","v":2.5999999999999998E-4},null,{"$f":"_xlfn.XLOOKUP($A14,db_LCA50!$A:$A,db_LCA50!U:U)","v":90.3},{"$f":"_xlfn.XLOOKUP($A14,db_LCA80!$A:$A,db_LCA80!U:U)","v":77.900000000000006},null,{"$f":"_xlfn.XLOOKUP($A14,db_LCA50!$A:$A,db_LCA50!X:X)","v":34.799999999999997},{"$f":"_xlfn.XLOOKUP($A14,db_LCA80!$A:$A,db_LCA80!X:X)","v":29.5},null,{"$f":"_xlfn.XLOOKUP($A14,db_LCA50!$A:$A,db_LCA50!AA:AA)","v":1.39},{"$f":"_xlfn.XLOOKUP($A14,db_LCA80!$A:$A,db_LCA80!AA:AA)","v":0.89400000000000002}]
["K06",null,null,"stor","beton/cement","beton/cement",null,"beton/cement","metal","beton/cement",null,"metal",null,"beton/cement","metal","træ","metal","metal",null,"tagpap",null,{"$f":"_xlfn.XLOOKUP(A15,db_LCA50!A:A,db_LCA50!C:C)","v":6.26},{"$f":"_xlfn.XLOOKUP($A15,db_LCA80!$A:$A,db_LCA80!C:C)","v":5.1100000000000003},null,{"$f":"_xlfn.XLOOKUP($A15,db_LCA50!$A:$A,db_LCA50!F:F)","v":1.04E-8},{"$f":"_xlfn.XLOOKUP($A15,db_LCA80!$A:$A,db_LCA80!F:F)","v":7.2799999999999997E-9},null,{"$f":"_xlfn.XLOOKUP($A15,db_LCA50!$A:$A,db_LCA50!I:I)","v":1.6799999999999999E-2},{"$f":"_xlfn.XLOOKUP($A15,db_LCA80!$A:$A,db_LCA80!I:I)","v":1.38E-2},null,{"$f":"_xlfn.XLOOKUP($A15,db_LCA50!$A:$A,db_LCA50!L:L)","v":1.82E-3},{"$f":"_xlfn.XLOOKUP($A15,db_LCA80!$A:$A,db_LCA80!L:L)","v":1.49E-3},null,{"$f":"_xlfn.XLOOKUP($A15,db_LCA50!$A:$A,db_LCA50!O:O)","v":2.9499999999999999E-3},{"$f":"_xlfn.XLOOKUP($A15,db_LCA80!$A:$A,db_LCA80!O:O)","v":2.4299999999999999E-3},null,{"$f":"_xlfn.XLOOKUP($A15,db_LCA50!$A:$A,db_LCA50!R:R)","v":1.7200000000000001E-4},{"$f":"_xlfn.XLOOKUP($A15,db_LCA80!$A:$A,db_LCA80!R:R)","v":1.25E-4},null,{"$f":"_xlfn.XLOOKUP($A15,db_LCA50!$A:$A,db_LCA50!U:U)","v":64.8},{"$f":"_xlfn.XLOOKUP($A15,db_LCA80!$A:$A,db_LCA80!U:U)","v":56.8},null,{"$f":"_xlfn.XLOOKUP($A15,db_LCA50!$A:$A,db_LCA50!X:X)","v":22.9},{"$f":"_xlfn.XLOOKUP($A15,db_LCA80!$A:$A,db_LCA80!X:X)","v":20.3},null,{"$f":"_xlfn.XLOOKUP($A15,db_LCA50!$A:$A,db_LCA50!AA:AA)","v":1.0900000000000001},{"$f":"_xlfn.XLOOKUP($A15,db_LCA80!$A:$A,db_LCA80!AA:AA)","v":0.68100000000000005}]
["K07",null,null,"mellem","beton/cement","beton/cement",null,"beton/cement",null,"beton/cement",null,"metal","tegl","beton/cement","metal","metal",null,"beton/cement",null,"tagpap",null,{"$f":"_xlfn.XLOOKUP(A16,db_LCA50!A:A,db_LCA50!C:C)","v":10.3},{"$f":"_xlfn.XLOOKUP($A16,db_LCA80!$A:$A,db_LCA80!C:C)","v":8.32},null,{"$f":"_xlfn.XLOOKUP($A16,db_LCA50!$A:$A,db_LCA50!F:F)","v":1.9399999999999998E-8},{"$f":"_xlfn.XLOOKUP($A16,db_LCA80!$A:$A,db_LCA80!F:F)","v":1.4E-8},null,{"$f":"_xlfn.XLOOKUP($A16,db_LCA50!$A:$A,db_LCA50!I:I)","v":2.1899999999999999E-2},{"$f":"_xlfn.XLOOKUP($A16,db_LCA80!$A:$A,db_LCA80!I:I)","v":1.78E-2},null,{"$f":"_xlfn.XLOOKUP($A16,db_LCA50!$A:$A,db_LCA50!L:L)","v":2.7899999999999999E-3},{"$f":"_xlfn.XLOOKUP($A16,db_LCA80!$A:$A,db_LCA80!L:L)","v":2.2100000000000002E-3},null,{"$f":"_xlfn.XLOOKUP($A16,db_LCA50!$A:$A,db_LCA50!O:O)","v":1.4200000000000001E-2},{"$f":"_xlfn.XLOOKUP($A16,db_LCA80!$A:$A,db_LCA80!O:O)","v":1.4500000000000001E-2},null,{"$f":"_xlfn.XLOOKUP($A16,db_LCA50!$A:$A,db_LCA50!R:R)","v":1.06E-4},{"$f":"_xlfn.XLOOKUP($A16,db_LCA80!$A:$A,db_LCA80!R:R)","v":9.5699999999999995E-5},null,{"$f":"_xlfn.XLOOKUP($A16,db_LCA50!$A:$A,db_LCA50!U:U)","v":102},{"$f":"_xlfn.XLOOKUP($A16,db_LCA80!$A:$A,db_LCA80!U:U)","v":89.1},null,{"$f":"_xlfn.XLOOKUP($A16,db_LCA50!$A:$A,db_LCA50!X:X)","v":34},{"$f":"_xlfn.XLOOKUP($A16,db_LCA80!$A:$A,db_LCA80!X:X)","v":29.5},null,{"$f":"_xlfn.XLOOKUP($A16,db_LCA50!$A:$A,db_LCA50!AA:AA)","v":2.25},{"$f":"_xlfn.XLOOKUP($A16,db_LCA80!$A:$A,db_LCA80!AA:AA)","v":1.42}]
["K08",null,null,"mellem","beton/cement","beton/cement",null,"beton/cement","metal","beton/cement",null,"tegl",null,"beton/cement","træ","træ",null,"beton/cement","metal","tagpap",null,{"$f":"_xlfn.XLOOKUP(A17,db_LCA50!A:A,db_LCA50!C:C)","v":8.9600000000000009},{"$f":"_xlfn.XLOOKUP($A17,db_LCA80!$A:$A,db_LCA80!C:C)","v":7.9},null,{"$f":"_xlfn.XLOOKUP($A17,db_LCA50!$A:$A,db_LCA50!F:F)","v":9.3700000000000005E-9},{"$f":"_xlfn.XLOOKUP($A17,db_LCA80!$A:$A,db_LCA80!F:F)","v":7.8899999999999998E-9},null,{"$f":"_xlfn.XLOOKUP($A17,db_LCA50!$A:$A,db_LCA50!I:I)","v":2.7E-2},{"$f":"_xlfn.XLOOKUP($A17,db_LCA80!$A:$A,db_LCA80!I:I)","v":2.3800000000000002E-2},null,{"$f":"_xlfn.XLOOKUP($A17,db_LCA50!$A:$A,db_LCA50!L:L)","v":3.46E-3},{"$f":"_xlfn.XLOOKUP($A17,db_LCA80!$A:$A,db_LCA80!L:L)","v":3.1099999999999999E-3},null,{"$f":"_xlfn.XLOOKUP($A17,db_LCA50!$A:$A,db_LCA50!O:O)","v":6.2100000000000002E-3},{"$f":"_xlfn.XLOOKUP($A17,db_LCA80!$A:$A,db_LCA80!O:O)","v":5.9800000000000001E-3},null,{"$f":"_xlfn.XLOOKUP($A17,db_LCA50!$A:$A,db_LCA50!R:R)","v":1.6699999999999999E-4},{"$f":"_xlfn.XLOOKUP($A17,db_LCA80!$A:$A,db_LCA80!R:R)","v":1.54E-4},null,{"$f":"_xlfn.XLOOKUP($A17,db_LCA50!$A:$A,db_LCA50!U:U)","v":97.4},{"$f":"_xlfn.XLOOKUP($A17,db_LCA80!$A:$A,db_LCA80!U:U)","v":90.3},null,{"$f":"_xlfn.XLOOKUP($A17,db_LCA50!$A:$A,db_LCA50!X:X)","v":36.200000000000003},{"$f":"_xlfn.XLOOKUP($A17,db_LCA80!$A:$A,db_LCA80!X:X)","v":34.799999999999997},null,{"$f":"_xlfn.XLOOKUP($A17,db_LCA50!$A:$A,db_LCA50!AA:AA)","v":0.79600000000000004},{"$f":"_xlfn.XLOOKUP($A17,db_LCA80!$A:$A,db_LCA80!AA:AA)","v":0.499}]
["K09",null,null,"stor","beton/cement","beton/cement",null,"beton/cement",null,"beton/cement",null,"tegl",null,"beton/cement",null,"træ","metal","beton/cement",null,"tagpap",null,{"$f":"_xlfn.XLOOKUP(A18,db_LCA50!A:A,db_LCA50!C:C)","v":7.84},{"$f":"_xlfn.XLOOKUP($A18,db_LCA80!$A:$A,db_LCA80!C:C)","v":6.04},null,{"$f":"_xlfn.XLOOKUP($A18,db_LCA50!$A:$A,db_LCA50!F:F)","v":9.2900000000000008E-9},{"$f":"_xlfn.XLOOKUP($A18,db_LCA80!$A:$A,db_LCA80!F:F)","v":6.2600000000000003E-9},null,{"$f":"_xlfn.XLOOKUP($A18,db_LCA50!$A:$A,db_LCA50!I:I)","v":2.07E-2},{"$f":"_xlfn.XLOOKUP($A18,db_LCA80!$A:$A,db_LCA80!I:I)","v":1.6899999999999998E-2},null,{"$f":"_xlfn.XLOOKUP($A18,db_LCA50!$A:$A,db_LCA50!L:L)","v":2.8400000000000001E-3},{"$f":"_xlfn.XLOOKUP($A18,db_LCA80!$A:$A,db_LCA80!L:L)","v":2.3600000000000001E-3},null,{"$f":"_xlfn.XLOOKUP($A18,db_LCA50!$A:$A,db_LCA50!O:O)","v":2.9499999999999999E-3},{"$f":"_xlfn.XLOOKUP($A18,db_LCA80!$A:$A,db_LCA80!O:O)","v":2.3400000000000001E-3},null,{"$f":"_xlfn.XLOOKUP($A18,db_LCA50!$A:$A,db_LCA50!R:R)","v":2.2900000000000001E-4},{"$f":"_xlfn.XLOOKUP($A18,db_LCA80!$A:$A,db_LCA80!R:R)","v":1.6699999999999999E-4},null,{"$f":"_xlfn.XLOOKUP($A18,db_LCA50!$A:$A,db_LCA50!U:U)","v":73.3},{"$f":"_xlfn.XLOOKUP($A18,db_LCA80!$A:$A,db_LCA80!U:U)","v":59.8},null,{"$f":"_xlfn.XLOOKUP($A18,db_LCA50!$A:$A,db_LCA50!X:X)","v":27.1},{"$f":"_xlfn.XLOOKUP($A18,db_LCA80!$A:$A,db_LCA80!X:X)","v":22.5},null,{"$f":"_xlfn.XLOOKUP($A18,db_LCA50!$A:$A,db_LCA50!AA:AA)","v":1.62},{"$f":"_xlfn.XLOOKUP($A18,db_LCA80!$A:$A,db_LCA80!AA:AA)","v":1.02}]
["K10",null,null,"mellem","beton/cement","beton/cement",null,"beton/cement",null,"beton/cement",null,"beton/cement","tegl","beton/cement",null,"metal",null,"beton/cement",null,"tagpap",null,{"$f":"_xlfn.XLOOKUP(A19,db_LCA50!A:A,db_LCA50!C:C)","v":10.8},{"$f":"_xlfn.XLOOKUP($A19,db_LCA80!$A:$A,db_LCA80!C:C)","v":9.27},null,{"$f":"_xlfn.XLOOKUP($A19,db_LCA50!$A:$A,db_LCA50!F:F)","v":2.0599999999999999E-8},{"$f":"_xlfn.XLOOKUP($A19,db_LCA80!$A:$A,db_LCA80!F:F)","v":1.6000000000000001E-8},null,{"$f":"_xlfn.XLOOKUP($A19,db_LCA50!$A:$A,db_LCA50!I:I)","v":2.7900000000000001E-2},{"$f":"_xlfn.XLOOKUP($A19,db_LCA80!$A:$A,db_LCA80!I:I)","v":2.3699999999999999E-2},null,{"$f":"_xlfn.XLOOKUP($A19,db_LCA50!$A:$A,db_LCA50!L:L)","v":3.6600000000000001E-3},{"$f":"_xlfn.XLOOKUP($A19,db_LCA80!$A:$A,db_LCA80!L:L)","v":3.1199999999999999E-3},null,{"$f":"_xlfn.XLOOKUP($A19,db_LCA50!$A:$A,db_LCA50!O:O)","v":5.2199999999999998E-3},{"$f":"_xlfn.XLOOKUP($A19,db_LCA80!$A:$A,db_LCA80!O:O)","v":5.2500000000000003E-3},null,{"$f":"_xlfn.XLOOKUP($A19,db_LCA50!$A:$A,db_LCA50!R:R)","v":2.3900000000000001E-4},{"$f":"_xlfn.XLOOKUP($A19,db_LCA80!$A:$A,db_LCA80!R:R)","v":1.95E-4},null,{"$f":"_xlfn.XLOOKUP($A19,db_LCA50!$A:$A,db_LCA50!U:U)","v":115},{"$f":"_xlfn.XLOOKUP($A19,db_LCA80!$A:$A,db_LCA80!U:U)","v":105},null,{"$f":"_xlfn.XLOOKUP($A19,db_LCA50!$A:$A,db_LCA50!X:X)","v":39.6},{"$f":"_xlfn.XLOOKUP($A19,db_LCA80!$A:$A,db_LCA80!X:X)","v":35.200000000000003},null,{"$f":"_xlfn.XLOOKUP($A19,db_LCA50!$A:$A,db_LCA50!AA:AA)","v":1.71},{"$f":"_xlfn.XLOOKUP($A19,db_LCA80!$A:$A,db_LCA80!AA:AA)","v":1.0900000000000001}]
["K11",null,null,"stor","beton/cement","beton/cement",null,"beton/cement",null,"beton/cement",null,"tegl",null,"beton/cement",null,"metal",null,"beton/cement","metal","tagpap",null,{"$f":"_xlfn.XLOOKUP(A20,db_LCA50!A:A,db_LCA50!C:C)","v":5.32},{"$f":"_xlfn.XLOOKUP($A20,db_LCA80!$A:$A,db_LCA80!C:C)","v":3.71},null,{"$f":"_xlfn.XLOOKUP($A20,db_LCA50!$A:$A,db_LCA50!F:F)","v":1.9000000000000001E-8},{"$f":"_xlfn.XLOOKUP($A20,db_LCA80!$A:$A,db_LCA80!F:F)","v":1.1900000000000001E-8},null,{"$f":"_xlfn.XLOOKUP($A20,db_LCA50!$A:$A,db_LCA50!I:I)","v":1.2999999999999999E-2},{"$f":"_xlfn.XLOOKUP($A20,db_LCA80!$A:$A,db_LCA80!I:I)","v":9.3100000000000006E-3},null,{"$f":"_xlfn.XLOOKUP($A20,db_LCA50!$A:$A,db_LCA50!L:L)","v":1.6900000000000001E-3},{"$f":"_xlfn.XLOOKUP($A20,db_LCA80!$A:$A,db_LCA80!L:L)","v":1.2199999999999999E-3},null,{"$f":"_xlfn.XLOOKUP($A20,db_LCA50!$A:$A,db_LCA50!O:O)","v":1.32E-3},{"$f":"_xlfn.XLOOKUP($A20,db_LCA80!$A:$A,db_LCA80!O:O)","v":9.4700000000000003E-4},null,{"$f":"_xlfn.XLOOKUP($A20,db_LCA50!$A:$A,db_LCA50!R:R)","v":3.6699999999999998E-5},{"$f":"_xlfn.XLOOKUP($A20,db_LCA80!$A:$A,db_LCA80!R:R)","v":3.04E-5},null,{"$f":"_xlfn.XLOOKUP($A20,db_LCA50!$A:$A,db_LCA50!U:U)","v":44.4},{"$f":"_xlfn.XLOOKUP($A20,db_LCA80!$A:$A,db_LCA80!U:U)","v":33.1},null,{"$f":"_xlfn.XLOOKUP($A20,db_LCA50!$A:$A,db_LCA50!X:X)","v":16.399999999999999},{"$f":"_xlfn.XLOOKUP($A20,db_LCA80!$A:$A,db_LCA80!X:X)","v":12},null,{"$f":"_xlfn.XLOOKUP($A20,db_LCA50!$A:$A,db_LCA50!AA:AA)","v":1.62},{"$f":"_xlfn.XLOOKUP($A20,db_LCA80!$A:$A,db_LCA80!AA:AA)","v":1.02}]
["K12",null,null,"mellem","beton/cement","beton/cement",null,"beton/cement",null,"beton/cement",null,"metal","tegl","beton/cement",null,"metal",null,"beton/cement",null,"tagpap",null,{"$f":"_xlfn.XLOOKUP(A21,db_LCA50!A:A,db_LCA50!C:C)","v":6.41},{"$f":"_xlfn.XLOOKUP($A21,db_LCA80!$A:$A,db_LCA80!C:C)","v":5.28},null,{"$f":"_xlfn.XLOOKUP($A21,db_LCA50!$A:$A,db_LCA50!F:F)","v":5.9099999999999997E-9},{"$f":"_xlfn.XLOOKUP($A21,db_LCA80!$A:$A,db_LCA80!F:F)","v":4.1599999999999997E-9},null,{"$f":"_xlfn.XLOOKUP($A21,db_LCA50!$A:$A,db_LCA50!I:I)","v":1.8700000000000001E-2},{"$f":"_xlfn.XLOOKUP($A21,db_LCA80!$A:$A,db_LCA80!I:I)","v":1.6199999999999999E-2},null,{"$f":"_xlfn.XLOOKUP($A21,db_LCA50!$A:$A,db_LCA50!L:L)","v":2.8300000000000001E-3},{"$f":"_xlfn.XLOOKUP($A21,db_LCA80!$A:$A,db_LCA80!L:L)","v":2.48E-3},null,{"$f":"_xlfn.XLOOKUP($A21,db_LCA50!$A:$A,db_LCA50!O:O)","v":2.2200000000000002E-3},{"$f":"_xlfn.XLOOKUP($A21,db_LCA80!$A:$A,db_LCA80!O:O)","v":1.8E-3},null,{"$f":"_xlfn.XLOOKUP($A21,db_LCA50!$A:$A,db_LCA50!R:R)","v":1.2300000000000001E-4},{"$f":"_xlfn.XLOOKUP($A21,db_LCA80!$A:$A,db_LCA80!R:R)","v":8.7200000000000005E-5},null,{"$f":"_xlfn.XLOOKUP($A21,db_LCA50!$A:$A,db_LCA50!U:U)","v":61.4},{"$f":"_xlfn.XLOOKUP($A21,db_LCA80!$A:$A,db_LCA80!U:U)","v":53.6},null,{"$f":"_xlfn.XLOOKUP($A21,db_LCA50!$A:$A,db_LCA50!X:X)","v":20.2},{"$f":"_xlfn.XLOOKUP($A21,db_LCA80!$A:$A,db_LCA80!X:X)","v":17.399999999999999},null,{"$f":"_xlfn.XLOOKUP($A21,db_LCA50!$A:$A,db_LCA50!AA:AA)","v":1.17},{"$f":"_xlfn.XLOOKUP($A21,db_LCA80!$A:$A,db_LCA80!AA:AA)","v":0.74}]
["K13",null,null,"stor","beton/cement","beton/cement",null,"beton/cement",null,"beton/cement",null,"metal",null,"beton/cement","metal","træ","metal","beton/cement",null,"tagpap",null,{"$f":"_xlfn.XLOOKUP(A22,db_LCA50!A:A,db_LCA50!C:C)","v":4.8600000000000003},{"$f":"_xlfn.XLOOKUP($A22,db_LCA80!$A:$A,db_LCA80!C:C)","v":4.13},null,{"$f":"_xlfn.XLOOKUP($A22,db_LCA50!$A:$A,db_LCA50!F:F)","v":5.93E-9},{"$f":"_xlfn.XLOOKUP($A22,db_LCA80!$A:$A,db_LCA80!F:F)","v":4.1400000000000002E-9},null,{"$f":"_xlfn.XLOOKUP($A22,db_LCA50!$A:$A,db_LCA50!I:I)","v":1.3299999999999999E-2},{"$f":"_xlfn.XLOOKUP($A22,db_LCA80!$A:$A,db_LCA80!I:I)","v":1.2E-2},null,{"$f":"_xlfn.XLOOKUP($A22,db_LCA50!$A:$A,db_LCA50!L:L)","v":1.67E-3},{"$f":"_xlfn.XLOOKUP($A22,db_LCA80!$A:$A,db_LCA80!L:L)","v":1.49E-3},null,{"$f":"_xlfn.XLOOKUP($A22,db_LCA50!$A:$A,db_LCA50!O:O)","v":2.4599999999999999E-3},{"$f":"_xlfn.XLOOKUP($A22,db_LCA80!$A:$A,db_LCA80!O:O)","v":1.99E-3},null,{"$f":"_xlfn.XLOOKUP($A22,db_LCA50!$A:$A,db_LCA50!R:R)","v":1.03E-4},{"$f":"_xlfn.XLOOKUP($A22,db_LCA80!$A:$A,db_LCA80!R:R)","v":9.2200000000000005E-5},null,{"$f":"_xlfn.XLOOKUP($A22,db_LCA50!$A:$A,db_LCA50!U:U)","v":43.5},{"$f":"_xlfn.XLOOKUP($A22,db_LCA80!$A:$A,db_LCA80!U:U)","v":39.4},null,{"$f":"_xlfn.XLOOKUP($A22,db_LCA50!$A:$A,db_LCA50!X:X)","v":16.600000000000001},{"$f":"_xlfn.XLOOKUP($A22,db_LCA80!$A:$A,db_LCA80!X:X)","v":15.7},null,{"$f":"_xlfn.XLOOKUP($A22,db_LCA50!$A:$A,db_LCA50!AA:AA)","v":1.06},{"$f":"_xlfn.XLOOKUP($A22,db_LCA80!$A:$A,db_LCA80!AA:AA)","v":0.66800000000000004}]
["K14",null,null,"mellem","beton/cement","beton/cement",null,"beton/cement",null,"beton/cement",null,"metal","tegl","beton/cement","metal","metal",null,"beton/cement",null,"tagpap",null,{"$f":"_xlfn.XLOOKUP(A23,db_LCA50!A:A,db_LCA50!C:C)","v":7.75},{"$f":"_xlfn.XLOOKUP($A23,db_LCA80!$A:$A,db_LCA80!C:C)","v":6.37},null,{"$f":"_xlfn.XLOOKUP($A23,db_LCA50!$A:$A,db_LCA50!F:F)","v":1.24E-8},{"$f":"_xlfn.XLOOKUP($A23,db_LCA80!$A:$A,db_LCA80!F:F)","v":9.0900000000000007E-9},null,{"$f":"_xlfn.XLOOKUP($A23,db_LCA50!$A:$A,db_LCA50!I:I)","v":1.6299999999999999E-2},{"$f":"_xlfn.XLOOKUP($A23,db_LCA80!$A:$A,db_LCA80!I:I)","v":1.34E-2},null,{"$f":"_xlfn.XLOOKUP($A23,db_LCA50!$A:$A,db_LCA50!L:L)","v":2.1800000000000001E-3},{"$f":"_xlfn.XLOOKUP($A23,db_LCA80!$A:$A,db_LCA80!L:L)","v":1.81E-3},null,{"$f":"_xlfn.XLOOKUP($A23,db_LCA50!$A:$A,db_LCA50!O:O)","v":7.4400000000000004E-3},{"$f":"_xlfn.XLOOKUP($A23,db_LCA80!$A:$A,db_LCA80!O:O)","v":6.4999999999999997E-3},null,{"$f":"_xlfn.XLOOKUP($A23,db_LCA50!$A:$A,db_LCA50!R:R)","v":6.9499999999999995E-5},{"$f":"_xlfn.XLOOKUP($A23,db_LCA80!$A:$A,db_LCA80!R:R)","v":5.8999999999999998E-5},null,{"$f":"_xlfn.XLOOKUP($A23,db_LCA50!$A:$A,db_LCA50!U:U)","v":79.5},{"$f":"_xlfn.XLOOKUP($A23,db_LCA80!$A:$A,db_LCA80!U:U)","v":68.8},null,{"$f":"_xlfn.XLOOKUP($A23,db_LCA50!$A:$A,db_LCA50!X:X)","v":26.3},{"$f":"_xlfn.XLOOKUP($A23,db_LCA80!$A:$A,db_LCA80!X:X)","v":22.7},null,{"$f":"_xlfn.XLOOKUP($A23,db_LCA50!$A:$A,db_LCA50!AA:AA)","v":1.45},{"$f":"_xlfn.XLOOKUP($A23,db_LCA80!$A:$A,db_LCA80!AA:AA)","v":0.90900000000000003}]
["K15",null,null,"mellem","beton/cement","beton/cement",null,"beton/cement",null,"beton/cement","metal","metal","tegl","beton/cement","metal","metal",null,"beton/cement",null,"tagpap",null,{"$f":"_xlfn.XLOOKUP(A24,db_LCA50!A:A,db_LCA50!C:C)","v":6.58},{"$f":"_xlfn.XLOOKUP($A24,db_LCA80!$A:$A,db_LCA80!C:C)","v":4.8},null,{"$f":"_xlfn.XLOOKUP($A24,db_LCA50!$A:$A,db_LCA50!F:F)","v":1.1700000000000001E-8},{"$f":"_xlfn.XLOOKUP($A24,db_LCA80!$A:$A,db_LCA80!F:F)","v":8.2100000000000004E-9},null,{"$f":"_xlfn.XLOOKUP($A24,db_LCA50!$A:$A,db_LCA50!I:I)","v":1.49E-2},{"$f":"_xlfn.XLOOKUP($A24,db_LCA80!$A:$A,db_LCA80!I:I)","v":1.12E-2},null,{"$f":"_xlfn.XLOOKUP($A24,db_LCA50!$A:$A,db_LCA50!L:L)","v":1.8600000000000001E-3},{"$f":"_xlfn.XLOOKUP($A24,db_LCA80!$A:$A,db_LCA80!L:L)","v":1.4E-3},null,{"$f":"_xlfn.XLOOKUP($A24,db_LCA50!$A:$A,db_LCA50!O:O)","v":4.3200000000000001E-3},{"$f":"_xlfn.XLOOKUP($A24,db_LCA80!$A:$A,db_LCA80!O:O)","v":3.2699999999999999E-3},null,{"$f":"_xlfn.XLOOKUP($A24,db_LCA50!$A:$A,db_LCA50!R:R)","v":7.9599999999999997E-5},{"$f":"_xlfn.XLOOKUP($A24,db_LCA80!$A:$A,db_LCA80!R:R)","v":7.0900000000000002E-5},null,{"$f":"_xlfn.XLOOKUP($A24,db_LCA50!$A:$A,db_LCA50!U:U)","v":59.2},{"$f":"_xlfn.XLOOKUP($A24,db_LCA80!$A:$A,db_LCA80!U:U)","v":46.1},null,{"$f":"_xlfn.XLOOKUP($A24,db_LCA50!$A:$A,db_LCA50!X:X)","v":20.399999999999999},{"$f":"_xlfn.XLOOKUP($A24,db_LCA80!$A:$A,db_LCA80!X:X)","v":15.8},null,{"$f":"_xlfn.XLOOKUP($A24,db_LCA50!$A:$A,db_LCA50!AA:AA)","v":1.67},{"$f":"_xlfn.XLOOKUP($A24,db_LCA80!$A:$A,db_LCA80!AA:AA)","v":1.04}]
["K16",null,null,"stor","beton/cement","beton/cement",null,"beton/cement","metal","beton/cement",null,"beton/cement",null,"beton/cement","metal","metal",null,"beton/cement",null,"tagpap",null,{"$f":"_xlfn.XLOOKUP(A25,db_LCA50!A:A,db_LCA50!C:C)","v":6.7},{"$f":"_xlfn.XLOOKUP($A25,db_LCA80!$A:$A,db_LCA80!C:C)","v":5.56},null,{"$f":"_xlfn.XLOOKUP($A25,db_LCA50!$A:$A,db_LCA50!F:F)","v":9.7900000000000003E-9},{"$f":"_xlfn.XLOOKUP($A25,db_LCA80!$A:$A,db_LCA80!F:F)","v":7.37E-9},null,{"$f":"_xlfn.XLOOKUP($A25,db_LCA50!$A:$A,db_LCA50!I:I)","v":1.7100000000000001E-2},{"$f":"_xlfn.XLOOKUP($A25,db_LCA80!$A:$A,db_LCA80!I:I)","v":1.5299999999999999E-2},null,{"$f":"_xlfn.XLOOKUP($A25,db_LCA50!$A:$A,db_LCA50!L:L)","v":2.3999999999999998E-3},{"$f":"_xlfn.XLOOKUP($A25,db_LCA80!$A:$A,db_LCA80!L:L)","v":2.1199999999999999E-3},null,{"$f":"_xlfn.XLOOKUP($A25,db_LCA50!$A:$A,db_LCA50!O:O)","v":3.48E-3},{"$f":"_xlfn.XLOOKUP($A25,db_LCA80!$A:$A,db_LCA80!O:O)","v":3.0500000000000002E-3},null,{"$f":"_xlfn.XLOOKUP($A25,db_LCA50!$A:$A,db_LCA50!R:R)","v":9.48E-5},{"$f":"_xlfn.XLOOKUP($A25,db_LCA80!$A:$A,db_LCA80!R:R)","v":8.4400000000000005E-5},null,{"$f":"_xlfn.XLOOKUP($A25,db_LCA50!$A:$A,db_LCA50!U:U)","v":60},{"$f":"_xlfn.XLOOKUP($A25,db_LCA80!$A:$A,db_LCA80!U:U)","v":53.4},null,{"$f":"_xlfn.XLOOKUP($A25,db_LCA50!$A:$A,db_LCA50!X:X)","v":22.2},{"$f":"_xlfn.XLOOKUP($A25,db_LCA80!$A:$A,db_LCA80!X:X)","v":20.100000000000001},null,{"$f":"_xlfn.XLOOKUP($A25,db_LCA50!$A:$A,db_LCA50!AA:AA)","v":1.4},{"$f":"_xlfn.XLOOKUP($A25,db_LCA80!$A:$A,db_LCA80!AA:AA)","v":0.874}]
["K17",null,null,"mellem","beton/cement","beton/cement",null,"beton/cement",null,"beton/cement",null,"tegl",null,"beton/cement","metal","træ","metal","metal",null,"tagpap",null,{"$f":"_xlfn.XLOOKUP(A26,db_LCA50!A:A,db_LCA50!C:C)","v":6.98},{"$f":"_xlfn.XLOOKUP($A26,db_LCA80!$A:$A,db_LCA80!C:C)","v":5.88},null,{"$f":"_xlfn.XLOOKUP($A26,db_LCA50!$A:$A,db_LCA50!F:F)","v":9.6400000000000006E-9},{"$f":"_xlfn.XLOOKUP($A26,db_LCA80!$A:$A,db_LCA80!F:F)","v":7.0399999999999997E-9},null,{"$f":"_xlfn.XLOOKUP($A26,db_LCA50!$A:$A,db_LCA50!I:I)","v":1.5900000000000001E-2},{"$f":"_xlfn.XLOOKUP($A26,db_LCA80!$A:$A,db_LCA80!I:I)","v":1.38E-2},null,{"$f":"_xlfn.XLOOKUP($A26,db_LCA50!$A:$A,db_LCA50!L:L)","v":2.2200000000000002E-3},{"$f":"_xlfn.XLOOKUP($A26,db_LCA80!$A:$A,db_LCA80!L:L)","v":1.92E-3},null,{"$f":"_xlfn.XLOOKUP($A26,db_LCA50!$A:$A,db_LCA50!O:O)","v":5.6499999999999996E-3},{"$f":"_xlfn.XLOOKUP($A26,db_LCA80!$A:$A,db_LCA80!O:O)","v":5.11E-3},null,{"$f":"_xlfn.XLOOKUP($A26,db_LCA50!$A:$A,db_LCA50!R:R)","v":9.4599999999999996E-5},{"$f":"_xlfn.XLOOKUP($A26,db_LCA80!$A:$A,db_LCA80!R:R)","v":8.0099999999999995E-5},null,{"$f":"_xlfn.XLOOKUP($A26,db_LCA50!$A:$A,db_LCA50!U:U)","v":70},{"$f":"_xlfn.XLOOKUP($A26,db_LCA80!$A:$A,db_LCA80!U:U)","v":63.1},null,{"$f":"_xlfn.XLOOKUP($A26,db_LCA50!$A:$A,db_LCA50!X:X)","v":26.9},{"$f":"_xlfn.XLOOKUP($A26,db_LCA80!$A:$A,db_LCA80!X:X)","v":24.5},null,{"$f":"_xlfn.XLOOKUP($A26,db_LCA50!$A:$A,db_LCA50!AA:AA)","v":1.36},{"$f":"_xlfn.XLOOKUP($A26,db_LCA80!$A:$A,db_LCA80!AA:AA)","v":0.85599999999999998}]
["K18",null,null,"mellem","beton/cement","beton/cement",null,"beton/cement",null,"beton/cement","træ","beton/cement",null,"beton/cement",null,"træ","metal","beton/cement","metal","tagpap",null,{"$f":"_xlfn.XLOOKUP(A27,db_LCA50!A:A,db_LCA50!C:C)","v":10.3},{"$f":"_xlfn.XLOOKUP($A27,db_LCA80!$A:$A,db_LCA80!C:C)","v":7.88},null,{"$f":"_xlfn.XLOOKUP($A27,db_LCA50!$A:$A,db_LCA50!F:F)","v":8.4499999999999996E-9},{"$f":"_xlfn.XLOOKUP($A27,db_LCA80!$A:$A,db_LCA80!F:F)","v":5.4199999999999999E-9},null,{"$f":"_xlfn.XLOOKUP($A27,db_LCA50!$A:$A,db_LCA50!I:I)","v":2.4500000000000001E-2},{"$f":"_xlfn.XLOOKUP($A27,db_LCA80!$A:$A,db_LCA80!I:I)","v":1.95E-2},null,{"$f":"_xlfn.XLOOKUP($A27,db_LCA50!$A:$A,db_LCA50!L:L)","v":3.0400000000000002E-3},{"$f":"_xlfn.XLOOKUP($A27,db_LCA80!$A:$A,db_LCA80!L:L)","v":2.3600000000000001E-3},null,{"$f":"_xlfn.XLOOKUP($A27,db_LCA50!$A:$A,db_LCA50!O:O)","v":4.2399999999999998E-3},{"$f":"_xlfn.XLOOKUP($A27,db_LCA80!$A:$A,db_LCA80!O:O)","v":3.1199999999999999E-3},null,{"$f":"_xlfn.XLOOKUP($A27,db_LCA50!$A:$A,db_LCA50!R:R)","v":7.5400000000000003E-5},{"$f":"_xlfn.XLOOKUP($A27,db_LCA80!$A:$A,db_LCA80!R:R)","v":5.8199999999999998E-5},null,{"$f":"_xlfn.XLOOKUP($A27,db_LCA50!$A:$A,db_LCA50!U:U)","v":85.6},{"$f":"_xlfn.XLOOKUP($A27,db_LCA80!$A:$A,db_LCA80!U:U)","v":70.599999999999994},null,{"$f":"_xlfn.XLOOKUP($A27,db_LCA50!$A:$A,db_LCA50!X:X)","v":31.2},{"$f":"_xlfn.XLOOKUP($A27,db_LCA80!$A:$A,db_LCA80!X:X)","v":26},null,{"$f":"_xlfn.XLOOKUP($A27,db_LCA50!$A:$A,db_LCA50!AA:AA)","v":2.82},{"$f":"_xlfn.XLOOKUP($A27,db_LCA80!$A:$A,db_LCA80!AA:AA)","v":1.77}]
["K19",null,null,"mellem","beton/cement","beton/cement",null,"beton/cement",null,"beton/cement","træ","træ","tegl","beton/cement","metal","metal",null,"beton/cement",null,"tagpap",null,{"$f":"_xlfn.XLOOKUP(A28,db_LCA50!A:A,db_LCA50!C:C)","v":6.9},{"$f":"_xlfn.XLOOKUP($A28,db_LCA80!$A:$A,db_LCA80!C:C)","v":5.3},null,{"$f":"_xlfn.XLOOKUP($A28,db_LCA50!$A:$A,db_LCA50!F:F)","v":3.6500000000000003E-8},{"$f":"_xlfn.XLOOKUP($A28,db_LCA80!$A:$A,db_LCA80!F:F)","v":3.6099999999999999E-8},null,{"$f":"_xlfn.XLOOKUP($A28,db_LCA50!$A:$A,db_LCA50!I:I)","v":1.6E-2},{"$f":"_xlfn.XLOOKUP($A28,db_LCA80!$A:$A,db_LCA80!I:I)","v":1.32E-2},null,{"$f":"_xlfn.XLOOKUP($A28,db_LCA50!$A:$A,db_LCA50!L:L)","v":2.2599999999999999E-3},{"$f":"_xlfn.XLOOKUP($A28,db_LCA80!$A:$A,db_LCA80!L:L)","v":1.8400000000000001E-3},null,{"$f":"_xlfn.XLOOKUP($A28,db_LCA50!$A:$A,db_LCA50!O:O)","v":3.2000000000000002E-3},{"$f":"_xlfn.XLOOKUP($A28,db_LCA80!$A:$A,db_LCA80!O:O)","v":2.8700000000000002E-3},null,{"$f":"_xlfn.XLOOKUP($A28,db_LCA50!$A:$A,db_LCA50!R:R)","v":1.83E-4},{"$f":"_xlfn.XLOOKUP($A28,db_LCA80!$A:$A,db_LCA80!R:R)","v":2.0900000000000001E-4},null,{"$f":"_xlfn.XLOOKUP($A28,db_LCA50!$A:$A,db_LCA50!U:U)","v":56.1},{"$f":"_xlfn.XLOOKUP($A28,db_LCA80!$A:$A,db_LCA80!U:U)","v":47.5},null,{"$f":"_xlfn.XLOOKUP($A28,db_LCA50!$A:$A,db_LCA50!X:X)","v":22.7},{"$f":"_xlfn.XLOOKUP($A28,db_LCA80!$A:$A,db_LCA80!X:X)","v":20.100000000000001},null,{"$f":"_xlfn.XLOOKUP($A28,db_LCA50!$A:$A,db_LCA50!AA:AA)","v":2.12},{"$f":"_xlfn.XLOOKUP($A28,db_LCA80!$A:$A,db_LCA80!AA:AA)","v":1.34}]
["K20",null,null,"stor","beton/cement","beton/cement",null,"beton/cement",null,"beton/cement",null,"beton/cement",null,"beton/cement","metal","træ","metal","beton/cement",null,"tagpap",null,{"$f":"_xlfn.XLOOKUP(A29,db_LCA50!A:A,db_LCA50!C:C)","v":8.5299999999999994},{"$f":"_xlfn.XLOOKUP($A29,db_LCA80!$A:$A,db_LCA80!C:C)","v":6.86},null,{"$f":"_xlfn.XLOOKUP($A29,db_LCA50!$A:$A,db_LCA50!F:F)","v":1.9099999999999999E-8},{"$f":"_xlfn.XLOOKUP($A29,db_LCA80!$A:$A,db_LCA80!F:F)","v":1.5700000000000002E-8},null,{"$f":"_xlfn.XLOOKUP($A29,db_LCA50!$A:$A,db_LCA50!I:I)","v":2.3300000000000001E-2},{"$f":"_xlfn.XLOOKUP($A29,db_LCA80!$A:$A,db_LCA80!I:I)","v":2.0299999999999999E-2},null,{"$f":"_xlfn.XLOOKUP($A29,db_LCA50!$A:$A,db_LCA50!L:L)","v":3.47E-3},{"$f":"_xlfn.XLOOKUP($A29,db_LCA80!$A:$A,db_LCA80!L:L)","v":3.0000000000000001E-3},null,{"$f":"_xlfn.XLOOKUP($A29,db_LCA50!$A:$A,db_LCA50!O:O)","v":2.7799999999999999E-3},{"$f":"_xlfn.XLOOKUP($A29,db_LCA80!$A:$A,db_LCA80!O:O)","v":2.33E-3},null,{"$f":"_xlfn.XLOOKUP($A29,db_LCA50!$A:$A,db_LCA50!R:R)","v":1.06E-4},{"$f":"_xlfn.XLOOKUP($A29,db_LCA80!$A:$A,db_LCA80!R:R)","v":9.2800000000000006E-5},null,{"$f":"_xlfn.XLOOKUP($A29,db_LCA50!$A:$A,db_LCA50!U:U)","v":82.5},{"$f":"_xlfn.XLOOKUP($A29,db_LCA80!$A:$A,db_LCA80!U:U)","v":72.8},null,{"$f":"_xlfn.XLOOKUP($A29,db_LCA50!$A:$A,db_LCA50!X:X)","v":27.6},{"$f":"_xlfn.XLOOKUP($A29,db_LCA80!$A:$A,db_LCA80!X:X)","v":24.3},null,{"$f":"_xlfn.XLOOKUP($A29,db_LCA50!$A:$A,db_LCA50!AA:AA)","v":2.21},{"$f":"_xlfn.XLOOKUP($A29,db_LCA80!$A:$A,db_LCA80!AA:AA)","v":1.41}]
["K21",null,null,"stor","beton/cement","beton/cement",null,"beton/cement",null,"beton/cement",null,"metal",null,"beton/cement","metal","træ","metal","beton/cement",null,"tagpap",null,{"$f":"_xlfn.XLOOKUP(A30,db_LCA50!A:A,db_LCA50!C:C)","v":6.46},{"$f":"_xlfn.XLOOKUP($A30,db_LCA80!$A:$A,db_LCA80!C:C)","v":4.76},null,{"$f":"_xlfn.XLOOKUP($A30,db_LCA50!$A:$A,db_LCA50!F:F)","v":1.03E-8},{"$f":"_xlfn.XLOOKUP($A30,db_LCA80!$A:$A,db_LCA80!F:F)","v":6.5000000000000003E-9},null,{"$f":"_xlfn.XLOOKUP($A30,db_LCA50!$A:$A,db_LCA50!I:I)","v":1.4800000000000001E-2},{"$f":"_xlfn.XLOOKUP($A30,db_LCA80!$A:$A,db_LCA80!I:I)","v":1.1599999999999999E-2},null,{"$f":"_xlfn.XLOOKUP($A30,db_LCA50!$A:$A,db_LCA50!L:L)","v":1.91E-3},{"$f":"_xlfn.XLOOKUP($A30,db_LCA80!$A:$A,db_LCA80!L:L)","v":1.47E-3},null,{"$f":"_xlfn.XLOOKUP($A30,db_LCA50!$A:$A,db_LCA50!O:O)","v":2.9399999999999999E-3},{"$f":"_xlfn.XLOOKUP($A30,db_LCA80!$A:$A,db_LCA80!O:O)","v":2.0999999999999999E-3},null,{"$f":"_xlfn.XLOOKUP($A30,db_LCA50!$A:$A,db_LCA50!R:R)","v":9.09E-5},{"$f":"_xlfn.XLOOKUP($A30,db_LCA80!$A:$A,db_LCA80!R:R)","v":7.9699999999999999E-5},null,{"$f":"_xlfn.XLOOKUP($A30,db_LCA50!$A:$A,db_LCA50!U:U)","v":54.1},{"$f":"_xlfn.XLOOKUP($A30,db_LCA80!$A:$A,db_LCA80!U:U)","v":42.7},null,{"$f":"_xlfn.XLOOKUP($A30,db_LCA50!$A:$A,db_LCA50!X:X)","v":18.7},{"$f":"_xlfn.XLOOKUP($A30,db_LCA80!$A:$A,db_LCA80!X:X)","v":14.7},null,{"$f":"_xlfn.XLOOKUP($A30,db_LCA50!$A:$A,db_LCA50!AA:AA)","v":1.92},{"$f":"_xlfn.XLOOKUP($A30,db_LCA80!$A:$A,db_LCA80!AA:AA)","v":1.2}]
["K22",null,null,"mellem","beton/cement","beton/cement",null,"beton/cement",null,"beton/cement",null,"beton/cement",null,"beton/cement",null,"træ","metal","metal",null,"tagpap",null,{"$f":"_xlfn.XLOOKUP(A31,db_LCA50!A:A,db_LCA50!C:C)","v":5.8},{"$f":"_xlfn.XLOOKUP($A31,db_LCA80!$A:$A,db_LCA80!C:C)","v":4.5999999999999996},null,{"$f":"_xlfn.XLOOKUP($A31,db_LCA50!$A:$A,db_LCA50!F:F)","v":8.2200000000000002E-9},{"$f":"_xlfn.XLOOKUP($A31,db_LCA80!$A:$A,db_LCA80!F:F)","v":5.5299999999999997E-9},null,{"$f":"_xlfn.XLOOKUP($A31,db_LCA50!$A:$A,db_LCA50!I:I)","v":1.47E-2},{"$f":"_xlfn.XLOOKUP($A31,db_LCA80!$A:$A,db_LCA80!I:I)","v":1.24E-2},null,{"$f":"_xlfn.XLOOKUP($A31,db_LCA50!$A:$A,db_LCA50!L:L)","v":1.91E-3},{"$f":"_xlfn.XLOOKUP($A31,db_LCA80!$A:$A,db_LCA80!L:L)","v":1.56E-3},null,{"$f":"_xlfn.XLOOKUP($A31,db_LCA50!$A:$A,db_LCA50!O:O)","v":2.2399999999999998E-3},{"$f":"_xlfn.XLOOKUP($A31,db_LCA80!$A:$A,db_LCA80!O:O)","v":1.64E-3},null,{"$f":"_xlfn.XLOOKUP($A31,db_LCA50!$A:$A,db_LCA50!R:R)","v":1.92E-4},{"$f":"_xlfn.XLOOKUP($A31,db_LCA80!$A:$A,db_LCA80!R:R)","v":1.6200000000000001E-4},null,{"$f":"_xlfn.XLOOKUP($A31,db_LCA50!$A:$A,db_LCA50!U:U)","v":55},{"$f":"_xlfn.XLOOKUP($A31,db_LCA80!$A:$A,db_LCA80!U:U)","v":46.7},null,{"$f":"_xlfn.XLOOKUP($A31,db_LCA50!$A:$A,db_LCA50!X:X)","v":20.399999999999999},{"$f":"_xlfn.XLOOKUP($A31,db_LCA80!$A:$A,db_LCA80!X:X)","v":17.2},null,{"$f":"_xlfn.XLOOKUP($A31,db_LCA50!$A:$A,db_LCA50!AA:AA)","v":1.28},{"$f":"_xlfn.XLOOKUP($A31,db_LCA80!$A:$A,db_LCA80!AA:AA)","v":0.8}]
["E01",null,null,"stor","beton/cement","beton/cement",null,"beton/cement",null,"beton/cement",null,"tegl",null,"beton/cement","metal","træ","metal","træ",null,"tagpap",null,{"$f":"_xlfn.XLOOKUP(A32,db_LCA50!A:A,db_LCA50!C:C)","v":6.95},{"$f":"_xlfn.XLOOKUP($A32,db_LCA80!$A:$A,db_LCA80!C:C)","v":5.04},null,{"$f":"_xlfn.XLOOKUP($A32,db_LCA50!$A:$A,db_LCA50!F:F)","v":2.2700000000000001E-8},{"$f":"_xlfn.XLOOKUP($A32,db_LCA80!$A:$A,db_LCA80!F:F)","v":1.63E-8},null,{"$f":"_xlfn.XLOOKUP($A32,db_LCA50!$A:$A,db_LCA50!I:I)","v":1.78E-2},{"$f":"_xlfn.XLOOKUP($A32,db_LCA80!$A:$A,db_LCA80!I:I)","v":1.2800000000000001E-2},null,{"$f":"_xlfn.XLOOKUP($A32,db_LCA50!$A:$A,db_LCA50!L:L)","v":2.0400000000000001E-3},{"$f":"_xlfn.XLOOKUP($A32,db_LCA80!$A:$A,db_LCA80!L:L)","v":1.5E-3},null,{"$f":"_xlfn.XLOOKUP($A32,db_LCA50!$A:$A,db_LCA50!O:O)","v":2.81E-3},{"$f":"_xlfn.XLOOKUP($A32,db_LCA80!$A:$A,db_LCA80!O:O)","v":2.3E-3},null,{"$f":"_xlfn.XLOOKUP($A32,db_LCA50!$A:$A,db_LCA50!R:R)","v":1.1E-4},{"$f":"_xlfn.XLOOKUP($A32,db_LCA80!$A:$A,db_LCA80!R:R)","v":7.9699999999999999E-5},null,{"$f":"_xlfn.XLOOKUP($A32,db_LCA50!$A:$A,db_LCA50!U:U)","v":64.3},{"$f":"_xlfn.XLOOKUP($A32,db_LCA80!$A:$A,db_LCA80!U:U)","v":48.8},null,{"$f":"_xlfn.XLOOKUP($A32,db_LCA50!$A:$A,db_LCA50!X:X)","v":24.1},{"$f":"_xlfn.XLOOKUP($A32,db_LCA80!$A:$A,db_LCA80!X:X)","v":18.7},null,{"$f":"_xlfn.XLOOKUP($A32,db_LCA50!$A:$A,db_LCA50!AA:AA)","v":1.74},{"$f":"_xlfn.XLOOKUP($A32,db_LCA80!$A:$A,db_LCA80!AA:AA)","v":1.1000000000000001}]
["E02",null,null,"stor","beton/cement","beton/cement",null,"beton/cement","træ","beton/cement",null,"metal","tegl","beton/cement","metal","træ","metal","beton/cement",null,"tagpap",null,{"$f":"_xlfn.XLOOKUP(A33,db_LCA50!A:A,db_LCA50!C:C)","v":7.05},{"$f":"_xlfn.XLOOKUP($A33,db_LCA80!$A:$A,db_LCA80!C:C)","v":5.1100000000000003},null,{"$f":"_xlfn.XLOOKUP($A33,db_LCA50!$A:$A,db_LCA50!F:F)","v":1.13E-8},{"$f":"_xlfn.XLOOKUP($A33,db_LCA80!$A:$A,db_LCA80!F:F)","v":7.3399999999999999E-9},null,{"$f":"_xlfn.XLOOKUP($A33,db_LCA50!$A:$A,db_LCA50!I:I)","v":1.55E-2},{"$f":"_xlfn.XLOOKUP($A33,db_LCA80!$A:$A,db_LCA80!I:I)","v":1.1900000000000001E-2},null,{"$f":"_xlfn.XLOOKUP($A33,db_LCA50!$A:$A,db_LCA50!L:L)","v":1.9499999999999999E-3},{"$f":"_xlfn.XLOOKUP($A33,db_LCA80!$A:$A,db_LCA80!L:L)","v":1.5100000000000001E-3},null,{"$f":"_xlfn.XLOOKUP($A33,db_LCA50!$A:$A,db_LCA50!O:O)","v":4.4099999999999999E-3},{"$f":"_xlfn.XLOOKUP($A33,db_LCA80!$A:$A,db_LCA80!O:O)","v":3.2000000000000002E-3},null,{"$f":"_xlfn.XLOOKUP($A33,db_LCA50!$A:$A,db_LCA50!R:R)","v":6.2899999999999997E-5},{"$f":"_xlfn.XLOOKUP($A33,db_LCA80!$A:$A,db_LCA80!R:R)","v":5.6700000000000003E-5},null,{"$f":"_xlfn.XLOOKUP($A33,db_LCA50!$A:$A,db_LCA50!U:U)","v":62.6},{"$f":"_xlfn.XLOOKUP($A33,db_LCA80!$A:$A,db_LCA80!U:U)","v":47.7},null,{"$f":"_xlfn.XLOOKUP($A33,db_LCA50!$A:$A,db_LCA50!X:X)","v":21.9},{"$f":"_xlfn.XLOOKUP($A33,db_LCA80!$A:$A,db_LCA80!X:X)","v":16.899999999999999},null,{"$f":"_xlfn.XLOOKUP($A33,db_LCA50!$A:$A,db_LCA50!AA:AA)","v":1.88},{"$f":"_xlfn.XLOOKUP($A33,db_LCA80!$A:$A,db_LCA80!AA:AA)","v":1.18}]
["E03",null,null,"stor","beton/cement","beton/cement",null,"beton/cement",null,"beton/cement",null,"tegl",null,"beton/cement",null,"træ","metal","beton/cement",null,"tagpap",null,{"$f":"_xlfn.XLOOKUP(A34,db_LCA50!A:A,db_LCA50!C:C)","v":6.32},{"$f":"_xlfn.XLOOKUP($A34,db_LCA80!$A:$A,db_LCA80!C:C)","v":4.8},null,{"$f":"_xlfn.XLOOKUP($A34,db_LCA50!$A:$A,db_LCA50!F:F)","v":1.4899999999999999E-8},{"$f":"_xlfn.XLOOKUP($A34,db_LCA80!$A:$A,db_LCA80!F:F)","v":1.2100000000000001E-8},null,{"$f":"_xlfn.XLOOKUP($A34,db_LCA50!$A:$A,db_LCA50!I:I)","v":1.5100000000000001E-2},{"$f":"_xlfn.XLOOKUP($A34,db_LCA80!$A:$A,db_LCA80!I:I)","v":1.26E-2},null,{"$f":"_xlfn.XLOOKUP($A34,db_LCA50!$A:$A,db_LCA50!L:L)","v":2.0999999999999999E-3},{"$f":"_xlfn.XLOOKUP($A34,db_LCA80!$A:$A,db_LCA80!L:L)","v":1.7099999999999999E-3},null,{"$f":"_xlfn.XLOOKUP($A34,db_LCA50!$A:$A,db_LCA50!O:O)","v":2.5200000000000001E-3},{"$f":"_xlfn.XLOOKUP($A34,db_LCA80!$A:$A,db_LCA80!O:O)","v":2.2599999999999999E-3},null,{"$f":"_xlfn.XLOOKUP($A34,db_LCA50!$A:$A,db_LCA50!R:R)","v":7.2200000000000007E-5},{"$f":"_xlfn.XLOOKUP($A34,db_LCA80!$A:$A,db_LCA80!R:R)","v":6.1600000000000007E-5},null,{"$f":"_xlfn.XLOOKUP($A34,db_LCA50!$A:$A,db_LCA50!U:U)","v":50.4},{"$f":"_xlfn.XLOOKUP($A34,db_LCA80!$A:$A,db_LCA80!U:U)","v":41.9},null,{"$f":"_xlfn.XLOOKUP($A34,db_LCA50!$A:$A,db_LCA50!X:X)","v":17.3},{"$f":"_xlfn.XLOOKUP($A34,db_LCA80!$A:$A,db_LCA80!X:X)","v":14.6},null,{"$f":"_xlfn.XLOOKUP($A34,db_LCA50!$A:$A,db_LCA50!AA:AA)","v":2.08},{"$f":"_xlfn.XLOOKUP($A34,db_LCA80!$A:$A,db_LCA80!AA:AA)","v":1.32}]
["E04",null,null,"stor","beton/cement","beton/cement",null,"beton/cement",null,"beton/cement",null,"tegl",null,"beton/cement","metal","træ","metal","beton/cement",null,"beton/cement",null,{"$f":"_xlfn.XLOOKUP(A35,db_LCA50!A:A,db_LCA50!C:C)","v":7.03},{"$f":"_xlfn.XLOOKUP($A35,db_LCA80!$A:$A,db_LCA80!C:C)","v":5.52},null,{"$f":"_xlfn.XLOOKUP($A35,db_LCA50!$A:$A,db_LCA50!F:F)","v":1.2499999999999999E-8},{"$f":"_xlfn.XLOOKUP($A35,db_LCA80!$A:$A,db_LCA80!F:F)","v":8.4800000000000005E-9},null,{"$f":"_xlfn.XLOOKUP($A35,db_LCA50!$A:$A,db_LCA50!I:I)","v":1.8800000000000001E-2},{"$f":"_xlfn.XLOOKUP($A35,db_LCA80!$A:$A,db_LCA80!I:I)","v":1.6400000000000001E-2},null,{"$f":"_xlfn.XLOOKUP($A35,db_LCA50!$A:$A,db_LCA50!L:L)","v":2.5300000000000001E-3},{"$f":"_xlfn.XLOOKUP($A35,db_LCA80!$A:$A,db_LCA80!L:L)","v":2.15E-3},null,{"$f":"_xlfn.XLOOKUP($A35,db_LCA50!$A:$A,db_LCA50!O:O)","v":2.0799999999999998E-3},{"$f":"_xlfn.XLOOKUP($A35,db_LCA80!$A:$A,db_LCA80!O:O)","v":1.8699999999999999E-3},null,{"$f":"_xlfn.XLOOKUP($A35,db_LCA50!$A:$A,db_LCA50!R:R)","v":7.9900000000000004E-5},{"$f":"_xlfn.XLOOKUP($A35,db_LCA80!$A:$A,db_LCA80!R:R)","v":7.1699999999999995E-5},null,{"$f":"_xlfn.XLOOKUP($A35,db_LCA50!$A:$A,db_LCA50!U:U)","v":58.1},{"$f":"_xlfn.XLOOKUP($A35,db_LCA80!$A:$A,db_LCA80!U:U)","v":49.5},null,{"$f":"_xlfn.XLOOKUP($A35,db_LCA50!$A:$A,db_LCA50!X:X)","v":22.8},{"$f":"_xlfn.XLOOKUP($A35,db_LCA80!$A:$A,db_LCA80!X:X)","v":20.100000000000001},null,{"$f":"_xlfn.XLOOKUP($A35,db_LCA50!$A:$A,db_LCA50!AA:AA)","v":2.02},{"$f":"_xlfn.XLOOKUP($A35,db_LCA80!$A:$A,db_LCA80!AA:AA)","v":1.28}]
["E05",null,null,"mellem","beton/cement","beton/cement",null,"beton/cement",null,"beton/cement",null,"beton/cement","træ","beton/cement",null,"træ","metal","beton/cement",null,"tagpap",null,{"$f":"_xlfn.XLOOKUP(A36,db_LCA50!A:A,db_LCA50!C:C)","v":8.8000000000000007},{"$f":"_xlfn.XLOOKUP($A36,db_LCA80!$A:$A,db_LCA80!C:C)","v":7.15},null,{"$f":"_xlfn.XLOOKUP($A36,db_LCA50!$A:$A,db_LCA50!F:F)","v":2.1900000000000001E-8},{"$f":"_xlfn.XLOOKUP($A36,db_LCA80!$A:$A,db_LCA80!F:F)","v":1.4699999999999999E-8},null,{"$f":"_xlfn.XLOOKUP($A36,db_LCA50!$A:$A,db_LCA50!I:I)","v":1.77E-2},{"$f":"_xlfn.XLOOKUP($A36,db_LCA80!$A:$A,db_LCA80!I:I)","v":1.5100000000000001E-2},null,{"$f":"_xlfn.XLOOKUP($A36,db_LCA50!$A:$A,db_LCA50!L:L)","v":2.4599999999999999E-3},{"$f":"_xlfn.XLOOKUP($A36,db_LCA80!$A:$A,db_LCA80!L:L)","v":2.0200000000000001E-3},null,{"$f":"_xlfn.XLOOKUP($A36,db_LCA50!$A:$A,db_LCA50!O:O)","v":3.5799999999999998E-3},{"$f":"_xlfn.XLOOKUP($A36,db_LCA80!$A:$A,db_LCA80!O:O)","v":2.7499999999999998E-3},null,{"$f":"_xlfn.XLOOKUP($A36,db_LCA50!$A:$A,db_LCA50!R:R)","v":1.34E-4},{"$f":"_xlfn.XLOOKUP($A36,db_LCA80!$A:$A,db_LCA80!R:R)","v":1.12E-4},null,{"$f":"_xlfn.XLOOKUP($A36,db_LCA50!$A:$A,db_LCA50!U:U)","v":71.2},{"$f":"_xlfn.XLOOKUP($A36,db_LCA80!$A:$A,db_LCA80!U:U)","v":64.5},null,{"$f":"_xlfn.XLOOKUP($A36,db_LCA50!$A:$A,db_LCA50!X:X)","v":25.5},{"$f":"_xlfn.XLOOKUP($A36,db_LCA80!$A:$A,db_LCA80!X:X)","v":23},null,{"$f":"_xlfn.XLOOKUP($A36,db_LCA50!$A:$A,db_LCA50!AA:AA)","v":2.8},{"$f":"_xlfn.XLOOKUP($A36,db_LCA80!$A:$A,db_LCA80!AA:AA)","v":1.76}]
["E06",null,null,"mellem","beton/cement","beton/cement",null,"beton/cement",null,"beton/cement",null,"træ",null,"beton/cement",null,"træ","metal","beton/cement",null,"tagpap",null,{"$f":"_xlfn.XLOOKUP(A37,db_LCA50!A:A,db_LCA50!C:C)","v":9.17},{"$f":"_xlfn.XLOOKUP($A37,db_LCA80!$A:$A,db_LCA80!C:C)","v":7.33},null,{"$f":"_xlfn.XLOOKUP($A37,db_LCA50!$A:$A,db_LCA50!F:F)","v":4.9200000000000004E-9},{"$f":"_xlfn.XLOOKUP($A37,db_LCA80!$A:$A,db_LCA80!F:F)","v":3.1399999999999999E-9},null,{"$f":"_xlfn.XLOOKUP($A37,db_LCA50!$A:$A,db_LCA50!I:I)","v":2.1899999999999999E-2},{"$f":"_xlfn.XLOOKUP($A37,db_LCA80!$A:$A,db_LCA80!I:I)","v":1.77E-2},null,{"$f":"_xlfn.XLOOKUP($A37,db_LCA50!$A:$A,db_LCA50!L:L)","v":2.65E-3},{"$f":"_xlfn.XLOOKUP($A37,db_LCA80!$A:$A,db_LCA80!L:L)","v":2.0799999999999998E-3},null,{"$f":"_xlfn.XLOOKUP($A37,db_LCA50!$A:$A,db_LCA50!O:O)","v":2.2399999999999998E-3},{"$f":"_xlfn.XLOOKUP($A37,db_LCA80!$A:$A,db_LCA80!O:O)","v":1.8400000000000001E-3},null,{"$f":"_xlfn.XLOOKUP($A37,db_LCA50!$A:$A,db_LCA50!R:R)","v":5.9599999999999996E-4},{"$f":"_xlfn.XLOOKUP($A37,db_LCA80!$A:$A,db_LCA80!R:R)","v":3.9399999999999998E-4},null,{"$f":"_xlfn.XLOOKUP($A37,db_LCA50!$A:$A,db_LCA50!U:U)","v":89.5},{"$f":"_xlfn.XLOOKUP($A37,db_LCA80!$A:$A,db_LCA80!U:U)","v":75},null,{"$f":"_xlfn.XLOOKUP($A37,db_LCA50!$A:$A,db_LCA50!X:X)","v":33.200000000000003},{"$f":"_xlfn.XLOOKUP($A37,db_LCA80!$A:$A,db_LCA80!X:X)","v":26.8},null,{"$f":"_xlfn.XLOOKUP($A37,db_LCA50!$A:$A,db_LCA50!AA:AA)","v":1.41},{"$f":"_xlfn.XLOOKUP($A37,db_LCA80!$A:$A,db_LCA80!AA:AA)","v":0.89200000000000002}]
["E07",null,null,"mellem","beton/cement","beton/cement",null,"træ",null,"træ",null,"træ",null,"træ",null,"træ",null,"træ",null,"metal",null,{"$f":"_xlfn.XLOOKUP(A38,db_LCA50!A:A,db_LCA50!C:C)","v":5.14},{"$f":"_xlfn.XLOOKUP($A38,db_LCA80!$A:$A,db_LCA80!C:C)","v":3.8},null,{"$f":"_xlfn.XLOOKUP($A38,db_LCA50!$A:$A,db_LCA50!F:F)","v":1.0700000000000001E-7},{"$f":"_xlfn.XLOOKUP($A38,db_LCA80!$A:$A,db_LCA80!F:F)","v":7.3799999999999999E-8},null,{"$f":"_xlfn.XLOOKUP($A38,db_LCA50!$A:$A,db_LCA50!I:I)","v":1.5699999999999999E-2},{"$f":"_xlfn.XLOOKUP($A38,db_LCA80!$A:$A,db_LCA80!I:I)","v":1.2E-2},null,{"$f":"_xlfn.XLOOKUP($A38,db_LCA50!$A:$A,db_LCA50!L:L)","v":2.3600000000000001E-3},{"$f":"_xlfn.XLOOKUP($A38,db_LCA80!$A:$A,db_LCA80!L:L)","v":1.7600000000000001E-3},null,{"$f":"_xlfn.XLOOKUP($A38,db_LCA50!$A:$A,db_LCA50!O:O)","v":2.1299999999999999E-3},{"$f":"_xlfn.XLOOKUP($A38,db_LCA80!$A:$A,db_LCA80!O:O)","v":1.66E-3},null,{"$f":"_xlfn.XLOOKUP($A38,db_LCA50!$A:$A,db_LCA50!R:R)","v":1.6200000000000001E-4},{"$f":"_xlfn.XLOOKUP($A38,db_LCA80!$A:$A,db_LCA80!R:R)","v":1.1400000000000001E-4},null,{"$f":"_xlfn.XLOOKUP($A38,db_LCA50!$A:$A,db_LCA50!U:U)","v":58.4},{"$f":"_xlfn.XLOOKUP($A38,db_LCA80!$A:$A,db_LCA80!U:U)","v":47.3},null,{"$f":"_xlfn.XLOOKUP($A38,db_LCA50!$A:$A,db_LCA50!X:X)","v":36.6},{"$f":"_xlfn.XLOOKUP($A38,db_LCA80!$A:$A,db_LCA80!X:X)","v":28.4},null,{"$f":"_xlfn.XLOOKUP($A38,db_LCA50!$A:$A,db_LCA50!AA:AA)","v":0.69499999999999995},{"$f":"_xlfn.XLOOKUP($A38,db_LCA80!$A:$A,db_LCA80!AA:AA)","v":0.441}]
["E08",null,null,"mellem","beton/cement","beton/cement",null,"beton/cement",null,"beton/cement",null,"tegl",null,"metal",null,"træ","metal","beton/cement","metal","tagpap",null,{"$f":"_xlfn.XLOOKUP(A39,db_LCA50!A:A,db_LCA50!C:C)","v":8.61},{"$f":"_xlfn.XLOOKUP($A39,db_LCA80!$A:$A,db_LCA80!C:C)","v":6.85},null,{"$f":"_xlfn.XLOOKUP($A39,db_LCA50!$A:$A,db_LCA50!F:F)","v":1.15E-8},{"$f":"_xlfn.XLOOKUP($A39,db_LCA80!$A:$A,db_LCA80!F:F)","v":7.9500000000000001E-9},null,{"$f":"_xlfn.XLOOKUP($A39,db_LCA50!$A:$A,db_LCA50!I:I)","v":2.06E-2},{"$f":"_xlfn.XLOOKUP($A39,db_LCA80!$A:$A,db_LCA80!I:I)","v":1.66E-2},null,{"$f":"_xlfn.XLOOKUP($A39,db_LCA50!$A:$A,db_LCA50!L:L)","v":2.3800000000000002E-3},{"$f":"_xlfn.XLOOKUP($A39,db_LCA80!$A:$A,db_LCA80!L:L)","v":1.8799999999999999E-3},null,{"$f":"_xlfn.XLOOKUP($A39,db_LCA50!$A:$A,db_LCA50!O:O)","v":6.0899999999999999E-3},{"$f":"_xlfn.XLOOKUP($A39,db_LCA80!$A:$A,db_LCA80!O:O)","v":5.0600000000000003E-3},null,{"$f":"_xlfn.XLOOKUP($A39,db_LCA50!$A:$A,db_LCA50!R:R)","v":2.3599999999999999E-4},{"$f":"_xlfn.XLOOKUP($A39,db_LCA80!$A:$A,db_LCA80!R:R)","v":1.8100000000000001E-4},null,{"$f":"_xlfn.XLOOKUP($A39,db_LCA50!$A:$A,db_LCA50!U:U)","v":84.2},{"$f":"_xlfn.XLOOKUP($A39,db_LCA80!$A:$A,db_LCA80!U:U)","v":72},null,{"$f":"_xlfn.XLOOKUP($A39,db_LCA50!$A:$A,db_LCA50!X:X)","v":29.4},{"$f":"_xlfn.XLOOKUP($A39,db_LCA80!$A:$A,db_LCA80!X:X)","v":25.6},null,{"$f":"_xlfn.XLOOKUP($A39,db_LCA50!$A:$A,db_LCA50!AA:AA)","v":1.76},{"$f":"_xlfn.XLOOKUP($A39,db_LCA80!$A:$A,db_LCA80!AA:AA)","v":1.1000000000000001}]
["E09",null,null,"stor","beton/cement","beton/cement",null,"beton/cement",null,"beton/cement",null,"tegl",null,"beton/cement",null,"træ","metal","beton/cement",null,"tagpap",null,{"$f":"_xlfn.XLOOKUP(A40,db_LCA50!A:A,db_LCA50!C:C)","v":6.64},{"$f":"_xlfn.XLOOKUP($A40,db_LCA80!$A:$A,db_LCA80!C:C)","v":5.04},null,{"$f":"_xlfn.XLOOKUP($A40,db_LCA50!$A:$A,db_LCA50!F:F)","v":9.6699999999999999E-9},{"$f":"_xlfn.XLOOKUP($A40,db_LCA80!$A:$A,db_LCA80!F:F)","v":6.7899999999999999E-9},null,{"$f":"_xlfn.XLOOKUP($A40,db_LCA50!$A:$A,db_LCA50!I:I)","v":1.47E-2},{"$f":"_xlfn.XLOOKUP($A40,db_LCA80!$A:$A,db_LCA80!I:I)","v":1.12E-2},null,{"$f":"_xlfn.XLOOKUP($A40,db_LCA50!$A:$A,db_LCA50!L:L)","v":1.91E-3},{"$f":"_xlfn.XLOOKUP($A40,db_LCA80!$A:$A,db_LCA80!L:L)","v":1.4400000000000001E-3},null,{"$f":"_xlfn.XLOOKUP($A40,db_LCA50!$A:$A,db_LCA50!O:O)","v":3.31E-3},{"$f":"_xlfn.XLOOKUP($A40,db_LCA80!$A:$A,db_LCA80!O:O)","v":2.3600000000000001E-3},null,{"$f":"_xlfn.XLOOKUP($A40,db_LCA50!$A:$A,db_LCA50!R:R)","v":7.8499999999999997E-5},{"$f":"_xlfn.XLOOKUP($A40,db_LCA80!$A:$A,db_LCA80!R:R)","v":6.6699999999999995E-5},null,{"$f":"_xlfn.XLOOKUP($A40,db_LCA50!$A:$A,db_LCA50!U:U)","v":63.3},{"$f":"_xlfn.XLOOKUP($A40,db_LCA80!$A:$A,db_LCA80!U:U)","v":50.9},null,{"$f":"_xlfn.XLOOKUP($A40,db_LCA50!$A:$A,db_LCA50!X:X)","v":21.2},{"$f":"_xlfn.XLOOKUP($A40,db_LCA80!$A:$A,db_LCA80!X:X)","v":17.2},null,{"$f":"_xlfn.XLOOKUP($A40,db_LCA50!$A:$A,db_LCA50!AA:AA)","v":1.43},{"$f":"_xlfn.XLOOKUP($A40,db_LCA80!$A:$A,db_LCA80!AA:AA)","v":0.89500000000000002}]
["E10",null,null,"mellem","beton/cement","beton/cement",null,"beton/cement",null,"beton/cement",null,"tegl",null,"beton/cement",null,"metal",null,"beton/cement",null,"tagpap",null,{"$f":"_xlfn.XLOOKUP(A41,db_LCA50!A:A,db_LCA50!C:C)","v":7.97},{"$f":"_xlfn.XLOOKUP($A41,db_LCA80!$A:$A,db_LCA80!C:C)","v":6.26},null,{"$f":"_xlfn.XLOOKUP($A41,db_LCA50!$A:$A,db_LCA50!F:F)","v":2.4699999999999999E-8},{"$f":"_xlfn.XLOOKUP($A41,db_LCA80!$A:$A,db_LCA80!F:F)","v":1.7199999999999999E-8},null,{"$f":"_xlfn.XLOOKUP($A41,db_LCA50!$A:$A,db_LCA50!I:I)","v":1.6899999999999998E-2},{"$f":"_xlfn.XLOOKUP($A41,db_LCA80!$A:$A,db_LCA80!I:I)","v":1.38E-2},null,{"$f":"_xlfn.XLOOKUP($A41,db_LCA50!$A:$A,db_LCA50!L:L)","v":2.2699999999999999E-3},{"$f":"_xlfn.XLOOKUP($A41,db_LCA80!$A:$A,db_LCA80!L:L)","v":1.7700000000000001E-3},null,{"$f":"_xlfn.XLOOKUP($A41,db_LCA50!$A:$A,db_LCA50!O:O)","v":2.3999999999999998E-3},{"$f":"_xlfn.XLOOKUP($A41,db_LCA80!$A:$A,db_LCA80!O:O)","v":1.7899999999999999E-3},null,{"$f":"_xlfn.XLOOKUP($A41,db_LCA50!$A:$A,db_LCA50!R:R)","v":6.6400000000000001E-5},{"$f":"_xlfn.XLOOKUP($A41,db_LCA80!$A:$A,db_LCA80!R:R)","v":6.6600000000000006E-5},null,{"$f":"_xlfn.XLOOKUP($A41,db_LCA50!$A:$A,db_LCA50!U:U)","v":66.8},{"$f":"_xlfn.XLOOKUP($A41,db_LCA80!$A:$A,db_LCA80!U:U)","v":58.6},null,{"$f":"_xlfn.XLOOKUP($A41,db_LCA50!$A:$A,db_LCA50!X:X)","v":24.1},{"$f":"_xlfn.XLOOKUP($A41,db_LCA80!$A:$A,db_LCA80!X:X)","v":20.8},null,{"$f":"_xlfn.XLOOKUP($A41,db_LCA50!$A:$A,db_LCA50!AA:AA)","v":2.37},{"$f":"_xlfn.XLOOKUP($A41,db_LCA80!$A:$A,db_LCA80!AA:AA)","v":1.48}]
["E11",null,null,"mellem","beton/cement","beton/cement",null,"beton/cement",null,"beton/cement",null,"metal",null,"beton/cement",null,"metal",null,"beton/cement",null,"tagpap",null,{"$f":"_xlfn.XLOOKUP(A42,db_LCA50!A:A,db_LCA50!C:C)","v":8.77},{"$f":"_xlfn.XLOOKUP($A42,db_LCA80!$A:$A,db_LCA80!C:C)","v":6.33},null,{"$f":"_xlfn.XLOOKUP($A42,db_LCA50!$A:$A,db_LCA50!F:F)","v":5.0600000000000003E-8},{"$f":"_xlfn.XLOOKUP($A42,db_LCA80!$A:$A,db_LCA80!F:F)","v":5.32E-8},null,{"$f":"_xlfn.XLOOKUP($A42,db_LCA50!$A:$A,db_LCA50!I:I)","v":2.2100000000000002E-2},{"$f":"_xlfn.XLOOKUP($A42,db_LCA80!$A:$A,db_LCA80!I:I)","v":1.6799999999999999E-2},null,{"$f":"_xlfn.XLOOKUP($A42,db_LCA50!$A:$A,db_LCA50!L:L)","v":2.5699999999999998E-3},{"$f":"_xlfn.XLOOKUP($A42,db_LCA80!$A:$A,db_LCA80!L:L)","v":1.97E-3},null,{"$f":"_xlfn.XLOOKUP($A42,db_LCA50!$A:$A,db_LCA50!O:O)","v":3.0100000000000001E-3},{"$f":"_xlfn.XLOOKUP($A42,db_LCA80!$A:$A,db_LCA80!O:O)","v":2.1700000000000001E-3},null,{"$f":"_xlfn.XLOOKUP($A42,db_LCA50!$A:$A,db_LCA50!R:R)","v":5.7599999999999997E-5},{"$f":"_xlfn.XLOOKUP($A42,db_LCA80!$A:$A,db_LCA80!R:R)","v":4.8099999999999997E-5},null,{"$f":"_xlfn.XLOOKUP($A42,db_LCA50!$A:$A,db_LCA50!U:U)","v":89},{"$f":"_xlfn.XLOOKUP($A42,db_LCA80!$A:$A,db_LCA80!U:U)","v":65.900000000000006},null,{"$f":"_xlfn.XLOOKUP($A42,db_LCA50!$A:$A,db_LCA50!X:X)","v":32.5},{"$f":"_xlfn.XLOOKUP($A42,db_LCA80!$A:$A,db_LCA80!X:X)","v":24.2},null,{"$f":"_xlfn.XLOOKUP($A42,db_LCA50!$A:$A,db_LCA50!AA:AA)","v":1.93},{"$f":"_xlfn.XLOOKUP($A42,db_LCA80!$A:$A,db_LCA80!AA:AA)","v":1.69}]
["Enf01",null,null,"lille","beton/cement","beton/cement",null,"træ",null,"beton/cement",null,"beton/cement","træ","metal",null,"træ","metal","metal",null,"tagpap",null,{"$f":"_xlfn.XLOOKUP(A43,db_LCA50!A:A,db_LCA50!C:C)","v":6.16},{"$f":"_xlfn.XLOOKUP($A43,db_LCA80!$A:$A,db_LCA80!C:C)","v":4.95},null,{"$f":"_xlfn.XLOOKUP($A43,db_LCA50!$A:$A,db_LCA50!F:F)","v":3.8199999999999998E-8},{"$f":"_xlfn.XLOOKUP($A43,db_LCA80!$A:$A,db_LCA80!F:F)","v":2.6000000000000001E-8},null,{"$f":"_xlfn.XLOOKUP($A43,db_LCA50!$A:$A,db_LCA50!I:I)","v":1.83E-2},{"$f":"_xlfn.XLOOKUP($A43,db_LCA80!$A:$A,db_LCA80!I:I)","v":1.4500000000000001E-2},null,{"$f":"_xlfn.XLOOKUP($A43,db_LCA50!$A:$A,db_LCA50!L:L)","v":2.16E-3},{"$f":"_xlfn.XLOOKUP($A43,db_LCA80!$A:$A,db_LCA80!L:L)","v":1.7700000000000001E-3},null,{"$f":"_xlfn.XLOOKUP($A43,db_LCA50!$A:$A,db_LCA50!O:O)","v":3.2399999999999998E-3},{"$f":"_xlfn.XLOOKUP($A43,db_LCA80!$A:$A,db_LCA80!O:O)","v":2.3400000000000001E-3},null,{"$f":"_xlfn.XLOOKUP($A43,db_LCA50!$A:$A,db_LCA50!R:R)","v":6.7899999999999997E-5},{"$f":"_xlfn.XLOOKUP($A43,db_LCA80!$A:$A,db_LCA80!R:R)","v":5.1900000000000001E-5},null,{"$f":"_xlfn.XLOOKUP($A43,db_LCA50!$A:$A,db_LCA50!U:U)","v":59.6},{"$f":"_xlfn.XLOOKUP($A43,db_LCA80!$A:$A,db_LCA80!U:U)","v":50.4},null,{"$f":"_xlfn.XLOOKUP($A43,db_LCA50!$A:$A,db_LCA50!X:X)","v":24.7},{"$f":"_xlfn.XLOOKUP($A43,db_LCA80!$A:$A,db_LCA80!X:X)","v":19.899999999999999},null,{"$f":"_xlfn.XLOOKUP($A43,db_LCA50!$A:$A,db_LCA50!AA:AA)","v":0.78100000000000003},{"$f":"_xlfn.XLOOKUP($A43,db_LCA80!$A:$A,db_LCA80!AA:AA)","v":0.504}]
["Enf02",null,null,"lille","beton/cement","beton/cement",null,null,null,"beton/cement",null,"tegl",null,"tegl",null,"træ","metal","træ",null,"tegl",null,{"$f":"_xlfn.XLOOKUP(A44,db_LCA50!A:A,db_LCA50!C:C)","v":7.1},{"$f":"_xlfn.XLOOKUP($A44,db_LCA80!$A:$A,db_LCA80!C:C)","v":5.19},null,{"$f":"_xlfn.XLOOKUP($A44,db_LCA50!$A:$A,db_LCA50!F:F)","v":5.1599999999999999E-8},{"$f":"_xlfn.XLOOKUP($A44,db_LCA80!$A:$A,db_LCA80!F:F)","v":3.2299999999999998E-8},null,{"$f":"_xlfn.XLOOKUP($A44,db_LCA50!$A:$A,db_LCA50!I:I)","v":1.7399999999999999E-2},{"$f":"_xlfn.XLOOKUP($A44,db_LCA80!$A:$A,db_LCA80!I:I)","v":1.2800000000000001E-2},null,{"$f":"_xlfn.XLOOKUP($A44,db_LCA50!$A:$A,db_LCA50!L:L)","v":2.3500000000000001E-3},{"$f":"_xlfn.XLOOKUP($A44,db_LCA80!$A:$A,db_LCA80!L:L)","v":1.74E-3},null,{"$f":"_xlfn.XLOOKUP($A44,db_LCA50!$A:$A,db_LCA50!O:O)","v":4.4600000000000004E-3},{"$f":"_xlfn.XLOOKUP($A44,db_LCA80!$A:$A,db_LCA80!O:O)","v":2.96E-3},null,{"$f":"_xlfn.XLOOKUP($A44,db_LCA50!$A:$A,db_LCA50!R:R)","v":5.3399999999999997E-5},{"$f":"_xlfn.XLOOKUP($A44,db_LCA80!$A:$A,db_LCA80!R:R)","v":5.3900000000000002E-5},null,{"$f":"_xlfn.XLOOKUP($A44,db_LCA50!$A:$A,db_LCA50!U:U)","v":82.1},{"$f":"_xlfn.XLOOKUP($A44,db_LCA80!$A:$A,db_LCA80!U:U)","v":61.1},null,{"$f":"_xlfn.XLOOKUP($A44,db_LCA50!$A:$A,db_LCA50!X:X)","v":34.1},{"$f":"_xlfn.XLOOKUP($A44,db_LCA80!$A:$A,db_LCA80!X:X)","v":24.4},null,{"$f":"_xlfn.XLOOKUP($A44,db_LCA50!$A:$A,db_LCA50!AA:AA)","v":0.79400000000000004},{"$f":"_xlfn.XLOOKUP($A44,db_LCA80!$A:$A,db_LCA80!AA:AA)","v":0.496}]
["Enf03",null,null,"lille","beton/cement","træ",null,"træ",null,"træ",null,"træ",null,"træ",null,"træ",null,"træ",null,"beton/cement",null,{"$f":"_xlfn.XLOOKUP(A45,db_LCA50!A:A,db_LCA50!C:C)","v":5.79},{"$f":"_xlfn.XLOOKUP($A45,db_LCA80!$A:$A,db_LCA80!C:C)","v":4.5599999999999996},null,{"$f":"_xlfn.XLOOKUP($A45,db_LCA50!$A:$A,db_LCA50!F:F)","v":8.8699999999999994E-8},{"$f":"_xlfn.XLOOKUP($A45,db_LCA80!$A:$A,db_LCA80!F:F)","v":7.6500000000000003E-8},null,{"$f":"_xlfn.XLOOKUP($A45,db_LCA50!$A:$A,db_LCA50!I:I)","v":2.5399999999999999E-2},{"$f":"_xlfn.XLOOKUP($A45,db_LCA80!$A:$A,db_LCA80!I:I)","v":1.95E-2},null,{"$f":"_xlfn.XLOOKUP($A45,db_LCA50!$A:$A,db_LCA50!L:L)","v":3.5599999999999998E-3},{"$f":"_xlfn.XLOOKUP($A45,db_LCA80!$A:$A,db_LCA80!L:L)","v":2.8400000000000001E-3},null,{"$f":"_xlfn.XLOOKUP($A45,db_LCA50!$A:$A,db_LCA50!O:O)","v":8.8900000000000003E-4},{"$f":"_xlfn.XLOOKUP($A45,db_LCA80!$A:$A,db_LCA80!O:O)","v":9.59E-4},null,{"$f":"_xlfn.XLOOKUP($A45,db_LCA50!$A:$A,db_LCA50!R:R)","v":3.0200000000000002E-4},{"$f":"_xlfn.XLOOKUP($A45,db_LCA80!$A:$A,db_LCA80!R:R)","v":2.02E-4},null,{"$f":"_xlfn.XLOOKUP($A45,db_LCA50!$A:$A,db_LCA50!U:U)","v":72.099999999999994},{"$f":"_xlfn.XLOOKUP($A45,db_LCA80!$A:$A,db_LCA80!U:U)","v":56.3},null,{"$f":"_xlfn.XLOOKUP($A45,db_LCA50!$A:$A,db_LCA50!X:X)","v":36.9},{"$f":"_xlfn.XLOOKUP($A45,db_LCA80!$A:$A,db_LCA80!X:X)","v":29.9},null,{"$f":"_xlfn.XLOOKUP($A45,db_LCA50!$A:$A,db_LCA50!AA:AA)","v":0.182},{"$f":"_xlfn.XLOOKUP($A45,db_LCA80!$A:$A,db_LCA80!AA:AA)","v":0.121}]
["Enf04",null,null,"lille","beton/cement","beton/cement",null,null,null,"beton/cement","træ","træ","tegl","beton/cement","tegl","træ","metal","træ",null,"tagpap",null,{"$f":"_xlfn.XLOOKUP(A46,db_LCA50!A:A,db_LCA50!C:C)","v":7.4},{"$f":"_xlfn.XLOOKUP($A46,db_LCA80!$A:$A,db_LCA80!C:C)","v":6.26},null,{"$f":"_xlfn.XLOOKUP($A46,db_LCA50!$A:$A,db_LCA50!F:F)","v":4.3800000000000002E-8},{"$f":"_xlfn.XLOOKUP($A46,db_LCA80!$A:$A,db_LCA80!F:F)","v":4.3800000000000002E-8},null,{"$f":"_xlfn.XLOOKUP($A46,db_LCA50!$A:$A,db_LCA50!I:I)","v":1.5800000000000002E-2},{"$f":"_xlfn.XLOOKUP($A46,db_LCA80!$A:$A,db_LCA80!I:I)","v":1.2699999999999999E-2},null,{"$f":"_xlfn.XLOOKUP($A46,db_LCA50!$A:$A,db_LCA50!L:L)","v":2.2100000000000002E-3},{"$f":"_xlfn.XLOOKUP($A46,db_LCA80!$A:$A,db_LCA80!L:L)","v":1.82E-3},null,{"$f":"_xlfn.XLOOKUP($A46,db_LCA50!$A:$A,db_LCA50!O:O)","v":5.3499999999999997E-3},{"$f":"_xlfn.XLOOKUP($A46,db_LCA80!$A:$A,db_LCA80!O:O)","v":3.6900000000000001E-3},null,{"$f":"_xlfn.XLOOKUP($A46,db_LCA50!$A:$A,db_LCA50!R:R)","v":9.7100000000000002E-5},{"$f":"_xlfn.XLOOKUP($A46,db_LCA80!$A:$A,db_LCA80!R:R)","v":6.8800000000000005E-5},null,{"$f":"_xlfn.XLOOKUP($A46,db_LCA50!$A:$A,db_LCA50!U:U)","v":80.3},{"$f":"_xlfn.XLOOKUP($A46,db_LCA80!$A:$A,db_LCA80!U:U)","v":67.900000000000006},null,{"$f":"_xlfn.XLOOKUP($A46,db_LCA50!$A:$A,db_LCA50!X:X)","v":33.1},{"$f":"_xlfn.XLOOKUP($A46,db_LCA80!$A:$A,db_LCA80!X:X)","v":28.7},null,{"$f":"_xlfn.XLOOKUP($A46,db_LCA50!$A:$A,db_LCA50!AA:AA)","v":0.68799999999999994},{"$f":"_xlfn.XLOOKUP($A46,db_LCA80!$A:$A,db_LCA80!AA:AA)","v":0.43}]
["Enf05",null,null,"lille","beton/cement","træ",null,null,null,"træ",null,"træ",null,"træ",null,"træ",null,"træ",null,"metal",null,{"$f":"_xlfn.XLOOKUP(A47,db_LCA50!A:A,db_LCA50!C:C)","v":3.67},{"$f":"_xlfn.XLOOKUP($A47,db_LCA80!$A:$A,db_LCA80!C:C)","v":3.11},null,{"$f":"_xlfn.XLOOKUP($A47,db_LCA50!$A:$A,db_LCA50!F:F)","v":1.1300000000000001E-7},{"$f":"_xlfn.XLOOKUP($A47,db_LCA80!$A:$A,db_LCA80!F:F)","v":7.1499999999999998E-8},null,{"$f":"_xlfn.XLOOKUP($A47,db_LCA50!$A:$A,db_LCA50!I:I)","v":1.35E-2},{"$f":"_xlfn.XLOOKUP($A47,db_LCA80!$A:$A,db_LCA80!I:I)","v":1.11E-2},null,{"$f":"_xlfn.XLOOKUP($A47,db_LCA50!$A:$A,db_LCA50!L:L)","v":2.2399999999999998E-3},{"$f":"_xlfn.XLOOKUP($A47,db_LCA80!$A:$A,db_LCA80!L:L)","v":1.72E-3},null,{"$f":"_xlfn.XLOOKUP($A47,db_LCA50!$A:$A,db_LCA50!O:O)","v":1.8400000000000001E-3},{"$f":"_xlfn.XLOOKUP($A47,db_LCA80!$A:$A,db_LCA80!O:O)","v":1.5E-3},null,{"$f":"_xlfn.XLOOKUP($A47,db_LCA50!$A:$A,db_LCA50!R:R)","v":8.5400000000000002E-5},{"$f":"_xlfn.XLOOKUP($A47,db_LCA80!$A:$A,db_LCA80!R:R)","v":7.1899999999999999E-5},null,{"$f":"_xlfn.XLOOKUP($A47,db_LCA50!$A:$A,db_LCA50!U:U)","v":41.5},{"$f":"_xlfn.XLOOKUP($A47,db_LCA80!$A:$A,db_LCA80!U:U)","v":35.799999999999997},null,{"$f":"_xlfn.XLOOKUP($A47,db_LCA50!$A:$A,db_LCA50!X:X)","v":34.1},{"$f":"_xlfn.XLOOKUP($A47,db_LCA80!$A:$A,db_LCA80!X:X)","v":25},null,{"$f":"_xlfn.XLOOKUP($A47,db_LCA50!$A:$A,db_LCA50!AA:AA)","v":0.32300000000000001},{"$f":"_xlfn.XLOOKUP($A47,db_LCA80!$A:$A,db_LCA80!AA:AA)","v":0.22700000000000001}]
["Enf06",null,null,"lille","beton/cement","beton/cement",null,null,null,"beton/cement",null,"tegl",null,"beton/cement","træ","træ",null,"træ",null,"tegl",null,{"$f":"_xlfn.XLOOKUP(A48,db_LCA50!A:A,db_LCA50!C:C)","v":7.98},{"$f":"_xlfn.XLOOKUP($A48,db_LCA80!$A:$A,db_LCA80!C:C)","v":5.82},null,{"$f":"_xlfn.XLOOKUP($A48,db_LCA50!$A:$A,db_LCA50!F:F)","v":4.51E-8},{"$f":"_xlfn.XLOOKUP($A48,db_LCA80!$A:$A,db_LCA80!F:F)","v":4.36E-8},null,{"$f":"_xlfn.XLOOKUP($A48,db_LCA50!$A:$A,db_LCA50!I:I)","v":1.9300000000000001E-2},{"$f":"_xlfn.XLOOKUP($A48,db_LCA80!$A:$A,db_LCA80!I:I)","v":1.5299999999999999E-2},null,{"$f":"_xlfn.XLOOKUP($A48,db_LCA50!$A:$A,db_LCA50!L:L)","v":2.7100000000000002E-3},{"$f":"_xlfn.XLOOKUP($A48,db_LCA80!$A:$A,db_LCA80!L:L)","v":2.1700000000000001E-3},null,{"$f":"_xlfn.XLOOKUP($A48,db_LCA50!$A:$A,db_LCA50!O:O)","v":5.1000000000000004E-3},{"$f":"_xlfn.XLOOKUP($A48,db_LCA80!$A:$A,db_LCA80!O:O)","v":3.5599999999999998E-3},null,{"$f":"_xlfn.XLOOKUP($A48,db_LCA50!$A:$A,db_LCA50!R:R)","v":5.0899999999999997E-5},{"$f":"_xlfn.XLOOKUP($A48,db_LCA80!$A:$A,db_LCA80!R:R)","v":4.4499999999999997E-5},null,{"$f":"_xlfn.XLOOKUP($A48,db_LCA50!$A:$A,db_LCA50!U:U)","v":91.4},{"$f":"_xlfn.XLOOKUP($A48,db_LCA80!$A:$A,db_LCA80!U:U)","v":66.5},null,{"$f":"_xlfn.XLOOKUP($A48,db_LCA50!$A:$A,db_LCA50!X:X)","v":35},{"$f":"_xlfn.XLOOKUP($A48,db_LCA80!$A:$A,db_LCA80!X:X)","v":26.8},null,{"$f":"_xlfn.XLOOKUP($A48,db_LCA50!$A:$A,db_LCA50!AA:AA)","v":0.65900000000000003},{"$f":"_xlfn.XLOOKUP($A48,db_LCA80!$A:$A,db_LCA80!AA:AA)","v":0.45600000000000002}]
["Enf07",null,null,"lille","beton/cement","beton/cement",null,null,null,"beton/cement",null,"beton/cement",null,"metal",null,"træ","metal","træ",null,"tagpap",null,{"$f":"_xlfn.XLOOKUP(A49,db_LCA50!A:A,db_LCA50!C:C)","v":7.62},{"$f":"_xlfn.XLOOKUP($A49,db_LCA80!$A:$A,db_LCA80!C:C)","v":6.61},null,{"$f":"_xlfn.XLOOKUP($A49,db_LCA50!$A:$A,db_LCA50!F:F)","v":1.0700000000000001E-7},{"$f":"_xlfn.XLOOKUP($A49,db_LCA80!$A:$A,db_LCA80!F:F)","v":1.2200000000000001E-7},null,{"$f":"_xlfn.XLOOKUP($A49,db_LCA50!$A:$A,db_LCA50!I:I)","v":1.4800000000000001E-2},{"$f":"_xlfn.XLOOKUP($A49,db_LCA80!$A:$A,db_LCA80!I:I)","v":1.29E-2},null,{"$f":"_xlfn.XLOOKUP($A49,db_LCA50!$A:$A,db_LCA50!L:L)","v":1.9499999999999999E-3},{"$f":"_xlfn.XLOOKUP($A49,db_LCA80!$A:$A,db_LCA80!L:L)","v":1.66E-3},null,{"$f":"_xlfn.XLOOKUP($A49,db_LCA50!$A:$A,db_LCA50!O:O)","v":6.9800000000000001E-3},{"$f":"_xlfn.XLOOKUP($A49,db_LCA80!$A:$A,db_LCA80!O:O)","v":5.2500000000000003E-3},null,{"$f":"_xlfn.XLOOKUP($A49,db_LCA50!$A:$A,db_LCA50!R:R)","v":6.7999999999999999E-5},{"$f":"_xlfn.XLOOKUP($A49,db_LCA80!$A:$A,db_LCA80!R:R)","v":6.3700000000000003E-5},null,{"$f":"_xlfn.XLOOKUP($A49,db_LCA50!$A:$A,db_LCA50!U:U)","v":87.3},{"$f":"_xlfn.XLOOKUP($A49,db_LCA80!$A:$A,db_LCA80!U:U)","v":80.900000000000006},null,{"$f":"_xlfn.XLOOKUP($A49,db_LCA50!$A:$A,db_LCA50!X:X)","v":38.6},{"$f":"_xlfn.XLOOKUP($A49,db_LCA80!$A:$A,db_LCA80!X:X)","v":37.799999999999997},null,{"$f":"_xlfn.XLOOKUP($A49,db_LCA50!$A:$A,db_LCA50!AA:AA)","v":1.06},{"$f":"_xlfn.XLOOKUP($A49,db_LCA80!$A:$A,db_LCA80!AA:AA)","v":0.67400000000000004}]
["Enf08",null,null,"lille","beton/cement","beton/cement",null,null,null,"beton/cement",null,"træ",null,"træ",null,"træ","metal","træ",null,"tagpap",null,{"$f":"_xlfn.XLOOKUP(A50,db_LCA50!A:A,db_LCA50!C:C)","v":9.36},{"$f":"_xlfn.XLOOKUP($A50,db_LCA80!$A:$A,db_LCA80!C:C)","v":8.5399999999999991},null,{"$f":"_xlfn.XLOOKUP($A50,db_LCA50!$A:$A,db_LCA50!F:F)","v":1.85E-7},{"$f":"_xlfn.XLOOKUP($A50,db_LCA80!$A:$A,db_LCA80!F:F)","v":1.99E-7},null,{"$f":"_xlfn.XLOOKUP($A50,db_LCA50!$A:$A,db_LCA50!I:I)","v":2.5399999999999999E-2},{"$f":"_xlfn.XLOOKUP($A50,db_LCA80!$A:$A,db_LCA80!I:I)","v":2.4400000000000002E-2},null,{"$f":"_xlfn.XLOOKUP($A50,db_LCA50!$A:$A,db_LCA50!L:L)","v":3.3400000000000001E-3},{"$f":"_xlfn.XLOOKUP($A50,db_LCA80!$A:$A,db_LCA80!L:L)","v":3.1199999999999999E-3},null,{"$f":"_xlfn.XLOOKUP($A50,db_LCA50!$A:$A,db_LCA50!O:O)","v":7.6800000000000002E-3},{"$f":"_xlfn.XLOOKUP($A50,db_LCA80!$A:$A,db_LCA80!O:O)","v":6.0600000000000003E-3},null,{"$f":"_xlfn.XLOOKUP($A50,db_LCA50!$A:$A,db_LCA50!R:R)","v":5.3999999999999998E-5},{"$f":"_xlfn.XLOOKUP($A50,db_LCA80!$A:$A,db_LCA80!R:R)","v":5.1900000000000001E-5},null,{"$f":"_xlfn.XLOOKUP($A50,db_LCA50!$A:$A,db_LCA50!U:U)","v":99.1},{"$f":"_xlfn.XLOOKUP($A50,db_LCA80!$A:$A,db_LCA80!U:U)","v":93.4},null,{"$f":"_xlfn.XLOOKUP($A50,db_LCA50!$A:$A,db_LCA50!X:X)","v":41.1},{"$f":"_xlfn.XLOOKUP($A50,db_LCA80!$A:$A,db_LCA80!X:X)","v":36.799999999999997},null,{"$f":"_xlfn.XLOOKUP($A50,db_LCA50!$A:$A,db_LCA50!AA:AA)","v":1.01},{"$f":"_xlfn.XLOOKUP($A50,db_LCA80!$A:$A,db_LCA80!AA:AA)","v":0.63900000000000001}]
["Enf09",null,null,"lille","beton/cement","beton/cement",null,null,null,"træ",null,"træ",null,"træ",null,"træ",null,"træ",null,"tegl",null,{"$f":"_xlfn.XLOOKUP(A51,db_LCA50!A:A,db_LCA50!C:C)","v":6.6},{"$f":"_xlfn.XLOOKUP($A51,db_LCA80!$A:$A,db_LCA80!C:C)","v":5.53},null,{"$f":"_xlfn.XLOOKUP($A51,db_LCA50!$A:$A,db_LCA50!F:F)","v":7.98E-8},{"$f":"_xlfn.XLOOKUP($A51,db_LCA80!$A:$A,db_LCA80!F:F)","v":5.2100000000000003E-8},null,{"$f":"_xlfn.XLOOKUP($A51,db_LCA50!$A:$A,db_LCA50!I:I)","v":1.7299999999999999E-2},{"$f":"_xlfn.XLOOKUP($A51,db_LCA80!$A:$A,db_LCA80!I:I)","v":1.49E-2},null,{"$f":"_xlfn.XLOOKUP($A51,db_LCA50!$A:$A,db_LCA50!L:L)","v":2.6900000000000001E-3},{"$f":"_xlfn.XLOOKUP($A51,db_LCA80!$A:$A,db_LCA80!L:L)","v":2.2699999999999999E-3},null,{"$f":"_xlfn.XLOOKUP($A51,db_LCA50!$A:$A,db_LCA50!O:O)","v":4.4400000000000004E-3},{"$f":"_xlfn.XLOOKUP($A51,db_LCA80!$A:$A,db_LCA80!O:O)","v":3.1700000000000001E-3},null,{"$f":"_xlfn.XLOOKUP($A51,db_LCA50!$A:$A,db_LCA50!R:R)","v":5.1100000000000002E-5},{"$f":"_xlfn.XLOOKUP($A51,db_LCA80!$A:$A,db_LCA80!R:R)","v":4.2599999999999999E-5},null,{"$f":"_xlfn.XLOOKUP($A51,db_LCA50!$A:$A,db_LCA50!U:U)","v":74.599999999999994},{"$f":"_xlfn.XLOOKUP($A51,db_LCA80!$A:$A,db_LCA80!U:U)","v":63.8},null,{"$f":"_xlfn.XLOOKUP($A51,db_LCA50!$A:$A,db_LCA50!X:X)","v":38.200000000000003},{"$f":"_xlfn.XLOOKUP($A51,db_LCA80!$A:$A,db_LCA80!X:X)","v":30.5},null,{"$f":"_xlfn.XLOOKUP($A51,db_LCA50!$A:$A,db_LCA50!AA:AA)","v":0.56699999999999995},{"$f":"_xlfn.XLOOKUP($A51,db_LCA80!$A:$A,db_LCA80!AA:AA)","v":0.36}]
["Enf10",null,null,"lille","beton/cement","beton/cement",null,null,null,"beton/cement",null,"tegl",null,"beton/cement",null,"træ","metal","træ",null,"tegl",null,{"$f":"_xlfn.XLOOKUP(A52,db_LCA50!A:A,db_LCA50!C:C)","v":8.52},{"$f":"_xlfn.XLOOKUP($A52,db_LCA80!$A:$A,db_LCA80!C:C)","v":6.76},null,{"$f":"_xlfn.XLOOKUP($A52,db_LCA50!$A:$A,db_LCA50!F:F)","v":1.31E-7},{"$f":"_xlfn.XLOOKUP($A52,db_LCA80!$A:$A,db_LCA80!F:F)","v":1.48E-7},null,{"$f":"_xlfn.XLOOKUP($A52,db_LCA50!$A:$A,db_LCA50!I:I)","v":2.0899999999999998E-2},{"$f":"_xlfn.XLOOKUP($A52,db_LCA80!$A:$A,db_LCA80!I:I)","v":1.7999999999999999E-2},null,{"$f":"_xlfn.XLOOKUP($A52,db_LCA50!$A:$A,db_LCA50!L:L)","v":2.8400000000000001E-3},{"$f":"_xlfn.XLOOKUP($A52,db_LCA80!$A:$A,db_LCA80!L:L)","v":2.4599999999999999E-3},null,{"$f":"_xlfn.XLOOKUP($A52,db_LCA50!$A:$A,db_LCA50!O:O)","v":6.4999999999999997E-3},{"$f":"_xlfn.XLOOKUP($A52,db_LCA80!$A:$A,db_LCA80!O:O)","v":4.8199999999999996E-3},null,{"$f":"_xlfn.XLOOKUP($A52,db_LCA50!$A:$A,db_LCA50!R:R)","v":4.8900000000000003E-5},{"$f":"_xlfn.XLOOKUP($A52,db_LCA80!$A:$A,db_LCA80!R:R)","v":4.2899999999999999E-5},null,{"$f":"_xlfn.XLOOKUP($A52,db_LCA50!$A:$A,db_LCA50!U:U)","v":94.9},{"$f":"_xlfn.XLOOKUP($A52,db_LCA80!$A:$A,db_LCA80!U:U)","v":76.7},null,{"$f":"_xlfn.XLOOKUP($A52,db_LCA50!$A:$A,db_LCA50!X:X)","v":35.299999999999997},{"$f":"_xlfn.XLOOKUP($A52,db_LCA80!$A:$A,db_LCA80!X:X)","v":29.1},null,{"$f":"_xlfn.XLOOKUP($A52,db_LCA50!$A:$A,db_LCA50!AA:AA)","v":1.02},{"$f":"_xlfn.XLOOKUP($A52,db_LCA80!$A:$A,db_LCA80!AA:AA)","v":0.64700000000000002}]
["Enf11",null,null,"lille","beton/cement","beton/cement",null,null,null,"beton/cement",null,"træ","tegl","beton/cement",null,"træ","metal","træ",null,"beton/cement",null,{"$f":"_xlfn.XLOOKUP(A53,db_LCA50!A:A,db_LCA50!C:C)","v":9.1199999999999992},{"$f":"_xlfn.XLOOKUP($A53,db_LCA80!$A:$A,db_LCA80!C:C)","v":7.3},null,{"$f":"_xlfn.XLOOKUP($A53,db_LCA50!$A:$A,db_LCA50!F:F)","v":1.18E-7},{"$f":"_xlfn.XLOOKUP($A53,db_LCA80!$A:$A,db_LCA80!F:F)","v":1.12E-7},null,{"$f":"_xlfn.XLOOKUP($A53,db_LCA50!$A:$A,db_LCA50!I:I)","v":2.41E-2},{"$f":"_xlfn.XLOOKUP($A53,db_LCA80!$A:$A,db_LCA80!I:I)","v":2.0299999999999999E-2},null,{"$f":"_xlfn.XLOOKUP($A53,db_LCA50!$A:$A,db_LCA50!L:L)","v":3.16E-3},{"$f":"_xlfn.XLOOKUP($A53,db_LCA80!$A:$A,db_LCA80!L:L)","v":2.5699999999999998E-3},null,{"$f":"_xlfn.XLOOKUP($A53,db_LCA50!$A:$A,db_LCA50!O:O)","v":7.11E-3},{"$f":"_xlfn.XLOOKUP($A53,db_LCA80!$A:$A,db_LCA80!O:O)","v":5.4999999999999997E-3},null,{"$f":"_xlfn.XLOOKUP($A53,db_LCA50!$A:$A,db_LCA50!R:R)","v":2.4399999999999999E-4},{"$f":"_xlfn.XLOOKUP($A53,db_LCA80!$A:$A,db_LCA80!R:R)","v":2.24E-4},null,{"$f":"_xlfn.XLOOKUP($A53,db_LCA50!$A:$A,db_LCA50!U:U)","v":97.1},{"$f":"_xlfn.XLOOKUP($A53,db_LCA80!$A:$A,db_LCA80!U:U)","v":80},null,{"$f":"_xlfn.XLOOKUP($A53,db_LCA50!$A:$A,db_LCA50!X:X)","v":46.4},{"$f":"_xlfn.XLOOKUP($A53,db_LCA80!$A:$A,db_LCA80!X:X)","v":38},null,{"$f":"_xlfn.XLOOKUP($A53,db_LCA50!$A:$A,db_LCA50!AA:AA)","v":1.06},{"$f":"_xlfn.XLOOKUP($A53,db_LCA80!$A:$A,db_LCA80!AA:AA)","v":0.66600000000000004}]
["R01",null,null,"lille","beton/cement","beton/cement",null,"beton/cement",null,"beton/cement",null,"tegl",null,"beton/cement",null,"træ","metal","træ",null,"tagpap",null,{"$f":"_xlfn.XLOOKUP(A54,db_LCA50!A:A,db_LCA50!C:C)","v":8.17},{"$f":"_xlfn.XLOOKUP($A54,db_LCA80!$A:$A,db_LCA80!C:C)","v":6.47},null,{"$f":"_xlfn.XLOOKUP($A54,db_LCA50!$A:$A,db_LCA50!F:F)","v":1.33E-8},{"$f":"_xlfn.XLOOKUP($A54,db_LCA80!$A:$A,db_LCA80!F:F)","v":8.6699999999999992E-9},null,{"$f":"_xlfn.XLOOKUP($A54,db_LCA50!$A:$A,db_LCA50!I:I)","v":2.98E-2},{"$f":"_xlfn.XLOOKUP($A54,db_LCA80!$A:$A,db_LCA80!I:I)","v":2.24E-2},null,{"$f":"_xlfn.XLOOKUP($A54,db_LCA50!$A:$A,db_LCA50!L:L)","v":2.8600000000000001E-3},{"$f":"_xlfn.XLOOKUP($A54,db_LCA80!$A:$A,db_LCA80!L:L)","v":2.2499999999999998E-3},null,{"$f":"_xlfn.XLOOKUP($A54,db_LCA50!$A:$A,db_LCA50!O:O)","v":4.0899999999999999E-3},{"$f":"_xlfn.XLOOKUP($A54,db_LCA80!$A:$A,db_LCA80!O:O)","v":3.13E-3},null,{"$f":"_xlfn.XLOOKUP($A54,db_LCA50!$A:$A,db_LCA50!R:R)","v":1.4899999999999999E-4},{"$f":"_xlfn.XLOOKUP($A54,db_LCA80!$A:$A,db_LCA80!R:R)","v":1.36E-4},null,{"$f":"_xlfn.XLOOKUP($A54,db_LCA50!$A:$A,db_LCA50!U:U)","v":84.3},{"$f":"_xlfn.XLOOKUP($A54,db_LCA80!$A:$A,db_LCA80!U:U)","v":70.2},null,{"$f":"_xlfn.XLOOKUP($A54,db_LCA50!$A:$A,db_LCA50!X:X)","v":32.200000000000003},{"$f":"_xlfn.XLOOKUP($A54,db_LCA80!$A:$A,db_LCA80!X:X)","v":27.3},null,{"$f":"_xlfn.XLOOKUP($A54,db_LCA50!$A:$A,db_LCA50!AA:AA)","v":0.77400000000000002},{"$f":"_xlfn.XLOOKUP($A54,db_LCA80!$A:$A,db_LCA80!AA:AA)","v":0.48799999999999999}]
["R02",null,null,"lille","beton/cement","beton/cement",null,"træ",null,"træ",null,"træ",null,"træ",null,"metal",null,"træ",null,"tagpap",null,{"$f":"_xlfn.XLOOKUP(A55,db_LCA50!A:A,db_LCA50!C:C)","v":7.44},{"$f":"_xlfn.XLOOKUP($A55,db_LCA80!$A:$A,db_LCA80!C:C)","v":6.37},null,{"$f":"_xlfn.XLOOKUP($A55,db_LCA50!$A:$A,db_LCA50!F:F)","v":3.5299999999999998E-8},{"$f":"_xlfn.XLOOKUP($A55,db_LCA80!$A:$A,db_LCA80!F:F)","v":2.2600000000000001E-8},null,{"$f":"_xlfn.XLOOKUP($A55,db_LCA50!$A:$A,db_LCA50!I:I)","v":2.5499999999999998E-2},{"$f":"_xlfn.XLOOKUP($A55,db_LCA80!$A:$A,db_LCA80!I:I)","v":2.18E-2},null,{"$f":"_xlfn.XLOOKUP($A55,db_LCA50!$A:$A,db_LCA50!L:L)","v":3.1199999999999999E-3},{"$f":"_xlfn.XLOOKUP($A55,db_LCA80!$A:$A,db_LCA80!L:L)","v":2.65E-3},null,{"$f":"_xlfn.XLOOKUP($A55,db_LCA50!$A:$A,db_LCA50!O:O)","v":4.3400000000000001E-3},{"$f":"_xlfn.XLOOKUP($A55,db_LCA80!$A:$A,db_LCA80!O:O)","v":3.3300000000000001E-3},null,{"$f":"_xlfn.XLOOKUP($A55,db_LCA50!$A:$A,db_LCA50!R:R)","v":2.7099999999999997E-4},{"$f":"_xlfn.XLOOKUP($A55,db_LCA80!$A:$A,db_LCA80!R:R)","v":2.2499999999999999E-4},null,{"$f":"_xlfn.XLOOKUP($A55,db_LCA50!$A:$A,db_LCA50!U:U)","v":82.4},{"$f":"_xlfn.XLOOKUP($A55,db_LCA80!$A:$A,db_LCA80!U:U)","v":71.7},null,{"$f":"_xlfn.XLOOKUP($A55,db_LCA50!$A:$A,db_LCA50!X:X)","v":36.299999999999997},{"$f":"_xlfn.XLOOKUP($A55,db_LCA80!$A:$A,db_LCA80!X:X)","v":29.7},null,{"$f":"_xlfn.XLOOKUP($A55,db_LCA50!$A:$A,db_LCA50!AA:AA)","v":0.45500000000000002},{"$f":"_xlfn.XLOOKUP($A55,db_LCA80!$A:$A,db_LCA80!AA:AA)","v":0.30599999999999999}]
["R03",null,null,"lille","beton/cement","beton/cement",null,"træ",null,"beton/cement",null,"beton/cement","træ","beton/cement","træ","metal",null,"træ",null,"tagpap",null,{"$f":"_xlfn.XLOOKUP(A56,db_LCA50!A:A,db_LCA50!C:C)","v":8.11},{"$f":"_xlfn.XLOOKUP($A56,db_LCA80!$A:$A,db_LCA80!C:C)","v":6.72},null,{"$f":"_xlfn.XLOOKUP($A56,db_LCA50!$A:$A,db_LCA50!F:F)","v":9.7399999999999999E-9},{"$f":"_xlfn.XLOOKUP($A56,db_LCA80!$A:$A,db_LCA80!F:F)","v":6.89E-9},null,{"$f":"_xlfn.XLOOKUP($A56,db_LCA50!$A:$A,db_LCA50!I:I)","v":2.4400000000000002E-2},{"$f":"_xlfn.XLOOKUP($A56,db_LCA80!$A:$A,db_LCA80!I:I)","v":1.9800000000000002E-2},null,{"$f":"_xlfn.XLOOKUP($A56,db_LCA50!$A:$A,db_LCA50!L:L)","v":2.4199999999999998E-3},{"$f":"_xlfn.XLOOKUP($A56,db_LCA80!$A:$A,db_LCA80!L:L)","v":1.9300000000000001E-3},null,{"$f":"_xlfn.XLOOKUP($A56,db_LCA50!$A:$A,db_LCA50!O:O)","v":5.3E-3},{"$f":"_xlfn.XLOOKUP($A56,db_LCA80!$A:$A,db_LCA80!O:O)","v":3.7299999999999998E-3},null,{"$f":"_xlfn.XLOOKUP($A56,db_LCA50!$A:$A,db_LCA50!R:R)","v":2.2900000000000001E-4},{"$f":"_xlfn.XLOOKUP($A56,db_LCA80!$A:$A,db_LCA80!R:R)","v":1.8599999999999999E-4},null,{"$f":"_xlfn.XLOOKUP($A56,db_LCA50!$A:$A,db_LCA50!U:U)","v":94.5},{"$f":"_xlfn.XLOOKUP($A56,db_LCA80!$A:$A,db_LCA80!U:U)","v":80.3},null,{"$f":"_xlfn.XLOOKUP($A56,db_LCA50!$A:$A,db_LCA50!X:X)","v":33.1},{"$f":"_xlfn.XLOOKUP($A56,db_LCA80!$A:$A,db_LCA80!X:X)","v":27.8},null,{"$f":"_xlfn.XLOOKUP($A56,db_LCA50!$A:$A,db_LCA50!AA:AA)","v":0.75900000000000001},{"$f":"_xlfn.XLOOKUP($A56,db_LCA80!$A:$A,db_LCA80!AA:AA)","v":0.47799999999999998}]
["R04",null,null,"lille","beton/cement","beton/cement",null,null,null,"beton/cement","træ","træ","tegl","beton/cement","metal","træ","metal","beton/cement","metal","tagpap",null,{"$f":"_xlfn.XLOOKUP(A57,db_LCA50!A:A,db_LCA50!C:C)","v":10.8},{"$f":"_xlfn.XLOOKUP($A57,db_LCA80!$A:$A,db_LCA80!C:C)","v":9.06},null,{"$f":"_xlfn.XLOOKUP($A57,db_LCA50!$A:$A,db_LCA50!F:F)","v":1.4E-8},{"$f":"_xlfn.XLOOKUP($A57,db_LCA80!$A:$A,db_LCA80!F:F)","v":1.35E-8},null,{"$f":"_xlfn.XLOOKUP($A57,db_LCA50!$A:$A,db_LCA50!I:I)","v":3.1300000000000001E-2},{"$f":"_xlfn.XLOOKUP($A57,db_LCA80!$A:$A,db_LCA80!I:I)","v":2.47E-2},null,{"$f":"_xlfn.XLOOKUP($A57,db_LCA50!$A:$A,db_LCA50!L:L)","v":3.0100000000000001E-3},{"$f":"_xlfn.XLOOKUP($A57,db_LCA80!$A:$A,db_LCA80!L:L)","v":2.48E-3},null,{"$f":"_xlfn.XLOOKUP($A57,db_LCA50!$A:$A,db_LCA50!O:O)","v":6.6400000000000001E-3},{"$f":"_xlfn.XLOOKUP($A57,db_LCA80!$A:$A,db_LCA80!O:O)","v":5.2399999999999999E-3},null,{"$f":"_xlfn.XLOOKUP($A57,db_LCA50!$A:$A,db_LCA50!R:R)","v":1.6899999999999999E-4},{"$f":"_xlfn.XLOOKUP($A57,db_LCA80!$A:$A,db_LCA80!R:R)","v":1.66E-4},null,{"$f":"_xlfn.XLOOKUP($A57,db_LCA50!$A:$A,db_LCA50!U:U)","v":109},{"$f":"_xlfn.XLOOKUP($A57,db_LCA80!$A:$A,db_LCA80!U:U)","v":96.7},null,{"$f":"_xlfn.XLOOKUP($A57,db_LCA50!$A:$A,db_LCA50!X:X)","v":39.200000000000003},{"$f":"_xlfn.XLOOKUP($A57,db_LCA80!$A:$A,db_LCA80!X:X)","v":35.5},null,{"$f":"_xlfn.XLOOKUP($A57,db_LCA50!$A:$A,db_LCA50!AA:AA)","v":1.61},{"$f":"_xlfn.XLOOKUP($A57,db_LCA80!$A:$A,db_LCA80!AA:AA)","v":1.05}]
["R05",null,null,"lille","beton/cement","beton/cement",null,null,null,"beton/cement",null,"træ","tegl","beton/cement","metal","træ","metal","beton/cement","metal","tagpap",null,{"$f":"_xlfn.XLOOKUP(A58,db_LCA50!A:A,db_LCA50!C:C)","v":10.8},{"$f":"_xlfn.XLOOKUP($A58,db_LCA80!$A:$A,db_LCA80!C:C)","v":9.5},null,{"$f":"_xlfn.XLOOKUP($A58,db_LCA50!$A:$A,db_LCA50!F:F)","v":1.7599999999999999E-8},{"$f":"_xlfn.XLOOKUP($A58,db_LCA80!$A:$A,db_LCA80!F:F)","v":1.5300000000000001E-8},null,{"$f":"_xlfn.XLOOKUP($A58,db_LCA50!$A:$A,db_LCA50!I:I)","v":0.03},{"$f":"_xlfn.XLOOKUP($A58,db_LCA80!$A:$A,db_LCA80!I:I)","v":2.4199999999999999E-2},null,{"$f":"_xlfn.XLOOKUP($A58,db_LCA50!$A:$A,db_LCA50!L:L)","v":2.9199999999999999E-3},{"$f":"_xlfn.XLOOKUP($A58,db_LCA80!$A:$A,db_LCA80!L:L)","v":2.47E-3},null,{"$f":"_xlfn.XLOOKUP($A58,db_LCA50!$A:$A,db_LCA50!O:O)","v":7.5799999999999999E-3},{"$f":"_xlfn.XLOOKUP($A58,db_LCA80!$A:$A,db_LCA80!O:O)","v":7.1399999999999996E-3},null,{"$f":"_xlfn.XLOOKUP($A58,db_LCA50!$A:$A,db_LCA50!R:R)","v":1.8000000000000001E-4},{"$f":"_xlfn.XLOOKUP($A58,db_LCA80!$A:$A,db_LCA80!R:R)","v":1.84E-4},null,{"$f":"_xlfn.XLOOKUP($A58,db_LCA50!$A:$A,db_LCA50!U:U)","v":119},{"$f":"_xlfn.XLOOKUP($A58,db_LCA80!$A:$A,db_LCA80!U:U)","v":111},null,{"$f":"_xlfn.XLOOKUP($A58,db_LCA50!$A:$A,db_LCA50!X:X)","v":45.8},{"$f":"_xlfn.XLOOKUP($A58,db_LCA80!$A:$A,db_LCA80!X:X)","v":43.5},null,{"$f":"_xlfn.XLOOKUP($A58,db_LCA50!$A:$A,db_LCA50!AA:AA)","v":1.28},{"$f":"_xlfn.XLOOKUP($A58,db_LCA80!$A:$A,db_LCA80!AA:AA)","v":0.83799999999999997}]
["R06",null,null,"lille","beton/cement","beton/cement",null,null,null,"træ",null,"træ",null,"træ","metal","træ","metal","træ",null,"tagpap",null,{"$f":"_xlfn.XLOOKUP(A59,db_LCA50!A:A,db_LCA50!C:C)","v":4.42},{"$f":"_xlfn.XLOOKUP($A59,db_LCA80!$A:$A,db_LCA80!C:C)","v":3.6},null,{"$f":"_xlfn.XLOOKUP($A59,db_LCA50!$A:$A,db_LCA50!F:F)","v":4.5900000000000001E-8},{"$f":"_xlfn.XLOOKUP($A59,db_LCA80!$A:$A,db_LCA80!F:F)","v":2.88E-8},null,{"$f":"_xlfn.XLOOKUP($A59,db_LCA50!$A:$A,db_LCA50!I:I)","v":1.1299999999999999E-2},{"$f":"_xlfn.XLOOKUP($A59,db_LCA80!$A:$A,db_LCA80!I:I)","v":9.1800000000000007E-3},null,{"$f":"_xlfn.XLOOKUP($A59,db_LCA50!$A:$A,db_LCA50!L:L)","v":1.6999999999999999E-3},{"$f":"_xlfn.XLOOKUP($A59,db_LCA80!$A:$A,db_LCA80!L:L)","v":1.3500000000000001E-3},null,{"$f":"_xlfn.XLOOKUP($A59,db_LCA50!$A:$A,db_LCA50!O:O)","v":3.4199999999999999E-3},{"$f":"_xlfn.XLOOKUP($A59,db_LCA80!$A:$A,db_LCA80!O:O)","v":2.5500000000000002E-3},null,{"$f":"_xlfn.XLOOKUP($A59,db_LCA50!$A:$A,db_LCA50!R:R)","v":1.63E-4},{"$f":"_xlfn.XLOOKUP($A59,db_LCA80!$A:$A,db_LCA80!R:R)","v":1.12E-4},null,{"$f":"_xlfn.XLOOKUP($A59,db_LCA50!$A:$A,db_LCA50!U:U)","v":45.2},{"$f":"_xlfn.XLOOKUP($A59,db_LCA80!$A:$A,db_LCA80!U:U)","v":38},null,{"$f":"_xlfn.XLOOKUP($A59,db_LCA50!$A:$A,db_LCA50!X:X)","v":28.7},{"$f":"_xlfn.XLOOKUP($A59,db_LCA80!$A:$A,db_LCA80!X:X)","v":24},null,{"$f":"_xlfn.XLOOKUP($A59,db_LCA50!$A:$A,db_LCA50!AA:AA)","v":0.56899999999999995},{"$f":"_xlfn.XLOOKUP($A59,db_LCA80!$A:$A,db_LCA80!AA:AA)","v":0.35699999999999998}]
["R07",null,null,"lille","beton/cement","beton/cement",null,null,null,"træ",null,"træ",null,"træ",null,"træ","metal","træ",null,"tagpap",null,{"$f":"_xlfn.XLOOKUP(A60,db_LCA50!A:A,db_LCA50!C:C)","v":5.8},{"$f":"_xlfn.XLOOKUP($A60,db_LCA80!$A:$A,db_LCA80!C:C)","v":5.42},null,{"$f":"_xlfn.XLOOKUP($A60,db_LCA50!$A:$A,db_LCA50!F:F)","v":3.6400000000000002E-8},{"$f":"_xlfn.XLOOKUP($A60,db_LCA80!$A:$A,db_LCA80!F:F)","v":2.77E-8},null,{"$f":"_xlfn.XLOOKUP($A60,db_LCA50!$A:$A,db_LCA50!I:I)","v":1.37E-2},{"$f":"_xlfn.XLOOKUP($A60,db_LCA80!$A:$A,db_LCA80!I:I)","v":1.2500000000000001E-2},null,{"$f":"_xlfn.XLOOKUP($A60,db_LCA50!$A:$A,db_LCA50!L:L)","v":1.98E-3},{"$f":"_xlfn.XLOOKUP($A60,db_LCA80!$A:$A,db_LCA80!L:L)","v":1.8400000000000001E-3},null,{"$f":"_xlfn.XLOOKUP($A60,db_LCA50!$A:$A,db_LCA50!O:O)","v":5.3099999999999996E-3},{"$f":"_xlfn.XLOOKUP($A60,db_LCA80!$A:$A,db_LCA80!O:O)","v":3.7499999999999999E-3},null,{"$f":"_xlfn.XLOOKUP($A60,db_LCA50!$A:$A,db_LCA50!R:R)","v":5.0899999999999997E-5},{"$f":"_xlfn.XLOOKUP($A60,db_LCA80!$A:$A,db_LCA80!R:R)","v":4.4799999999999998E-5},null,{"$f":"_xlfn.XLOOKUP($A60,db_LCA50!$A:$A,db_LCA50!U:U)","v":72.599999999999994},{"$f":"_xlfn.XLOOKUP($A60,db_LCA80!$A:$A,db_LCA80!U:U)","v":68.400000000000006},null,{"$f":"_xlfn.XLOOKUP($A60,db_LCA50!$A:$A,db_LCA50!X:X)","v":28.6},{"$f":"_xlfn.XLOOKUP($A60,db_LCA80!$A:$A,db_LCA80!X:X)","v":26.1},null,{"$f":"_xlfn.XLOOKUP($A60,db_LCA50!$A:$A,db_LCA50!AA:AA)","v":0.22800000000000001},{"$f":"_xlfn.XLOOKUP($A60,db_LCA80!$A:$A,db_LCA80!AA:AA)","v":0.151}]
["R08",null,null,"lille","beton/cement","beton/cement",null,"beton/cement",null,"beton/cement",null,"tegl",null,"beton/cement","træ","træ","metal","beton/cement","træ","tagpap",null,{"$f":"_xlfn.XLOOKUP(A61,db_LCA50!A:A,db_LCA50!C:C)","v":7.39},{"$f":"_xlfn.XLOOKUP($A61,db_LCA80!$A:$A,db_LCA80!C:C)","v":5.79},null,{"$f":"_xlfn.XLOOKUP($A61,db_LCA50!$A:$A,db_LCA50!F:F)","v":8.6400000000000006E-8},{"$f":"_xlfn.XLOOKUP($A61,db_LCA80!$A:$A,db_LCA80!F:F)","v":9.4699999999999994E-8},null,{"$f":"_xlfn.XLOOKUP($A61,db_LCA50!$A:$A,db_LCA50!I:I)","v":1.67E-2},{"$f":"_xlfn.XLOOKUP($A61,db_LCA80!$A:$A,db_LCA80!I:I)","v":1.35E-2},null,{"$f":"_xlfn.XLOOKUP($A61,db_LCA50!$A:$A,db_LCA50!L:L)","v":2.1700000000000001E-3},{"$f":"_xlfn.XLOOKUP($A61,db_LCA80!$A:$A,db_LCA80!L:L)","v":1.6999999999999999E-3},null,{"$f":"_xlfn.XLOOKUP($A61,db_LCA50!$A:$A,db_LCA50!O:O)","v":3.9199999999999999E-3},{"$f":"_xlfn.XLOOKUP($A61,db_LCA80!$A:$A,db_LCA80!O:O)","v":2.9299999999999999E-3},null,{"$f":"_xlfn.XLOOKUP($A61,db_LCA50!$A:$A,db_LCA50!R:R)","v":7.1000000000000005E-5},{"$f":"_xlfn.XLOOKUP($A61,db_LCA80!$A:$A,db_LCA80!R:R)","v":6.3999999999999997E-5},null,{"$f":"_xlfn.XLOOKUP($A61,db_LCA50!$A:$A,db_LCA50!U:U)","v":72.5},{"$f":"_xlfn.XLOOKUP($A61,db_LCA80!$A:$A,db_LCA80!U:U)","v":59.4},null,{"$f":"_xlfn.XLOOKUP($A61,db_LCA50!$A:$A,db_LCA50!X:X)","v":27.4},{"$f":"_xlfn.XLOOKUP($A61,db_LCA80!$A:$A,db_LCA80!X:X)","v":22.4},null,{"$f":"_xlfn.XLOOKUP($A61,db_LCA50!$A:$A,db_LCA50!AA:AA)","v":1.53},{"$f":"_xlfn.XLOOKUP($A61,db_LCA80!$A:$A,db_LCA80!AA:AA)","v":0.95399999999999996}]
["R09",null,null,"lille","beton/cement","beton/cement",null,"træ",null,"beton/cement","træ","træ",null,"beton/cement","træ","træ","metal","træ",null,"tagpap",null,{"$f":"_xlfn.XLOOKUP(A62,db_LCA50!A:A,db_LCA50!C:C)","v":6.13},{"$f":"_xlfn.XLOOKUP($A62,db_LCA80!$A:$A,db_LCA80!C:C)","v":5.28},null,{"$f":"_xlfn.XLOOKUP($A62,db_LCA50!$A:$A,db_LCA50!F:F)","v":6.2299999999999995E-8},{"$f":"_xlfn.XLOOKUP($A62,db_LCA80!$A:$A,db_LCA80!F:F)","v":4.0900000000000002E-8},null,{"$f":"_xlfn.XLOOKUP($A62,db_LCA50!$A:$A,db_LCA50!I:I)","v":1.6400000000000001E-2},{"$f":"_xlfn.XLOOKUP($A62,db_LCA80!$A:$A,db_LCA80!I:I)","v":1.3899999999999999E-2},null,{"$f":"_xlfn.XLOOKUP($A62,db_LCA50!$A:$A,db_LCA50!L:L)","v":2.3800000000000002E-3},{"$f":"_xlfn.XLOOKUP($A62,db_LCA80!$A:$A,db_LCA80!L:L)","v":1.98E-3},null,{"$f":"_xlfn.XLOOKUP($A62,db_LCA50!$A:$A,db_LCA50!O:O)","v":3.5799999999999998E-3},{"$f":"_xlfn.XLOOKUP($A62,db_LCA80!$A:$A,db_LCA80!O:O)","v":2.8300000000000001E-3},null,{"$f":"_xlfn.XLOOKUP($A62,db_LCA50!$A:$A,db_LCA50!R:R)","v":1.17E-4},{"$f":"_xlfn.XLOOKUP($A62,db_LCA80!$A:$A,db_LCA80!R:R)","v":8.81E-5},null,{"$f":"_xlfn.XLOOKUP($A62,db_LCA50!$A:$A,db_LCA50!U:U)","v":67.3},{"$f":"_xlfn.XLOOKUP($A62,db_LCA80!$A:$A,db_LCA80!U:U)","v":60.2},null,{"$f":"_xlfn.XLOOKUP($A62,db_LCA50!$A:$A,db_LCA50!X:X)","v":36.4},{"$f":"_xlfn.XLOOKUP($A62,db_LCA80!$A:$A,db_LCA80!X:X)","v":30.6},null,{"$f":"_xlfn.XLOOKUP($A62,db_LCA50!$A:$A,db_LCA50!AA:AA)","v":0.58599999999999997},{"$f":"_xlfn.XLOOKUP($A62,db_LCA80!$A:$A,db_LCA80!AA:AA)","v":0.372}]
["R10",null,null,"lille","beton/cement","beton/cement",null,"træ","metal","træ",null,"træ",null,"beton/cement","træ","træ","metal","træ",null,"træ",null,{"$f":"_xlfn.XLOOKUP(A63,db_LCA50!A:A,db_LCA50!C:C)","v":5.9},{"$f":"_xlfn.XLOOKUP($A63,db_LCA80!$A:$A,db_LCA80!C:C)","v":5.09},null,{"$f":"_xlfn.XLOOKUP($A63,db_LCA50!$A:$A,db_LCA50!F:F)","v":1.05E-7},{"$f":"_xlfn.XLOOKUP($A63,db_LCA80!$A:$A,db_LCA80!F:F)","v":8.2599999999999998E-8},null,{"$f":"_xlfn.XLOOKUP($A63,db_LCA50!$A:$A,db_LCA50!I:I)","v":1.7899999999999999E-2},{"$f":"_xlfn.XLOOKUP($A63,db_LCA80!$A:$A,db_LCA80!I:I)","v":1.5299999999999999E-2},null,{"$f":"_xlfn.XLOOKUP($A63,db_LCA50!$A:$A,db_LCA50!L:L)","v":2.7899999999999999E-3},{"$f":"_xlfn.XLOOKUP($A63,db_LCA80!$A:$A,db_LCA80!L:L)","v":2.3600000000000001E-3},null,{"$f":"_xlfn.XLOOKUP($A63,db_LCA50!$A:$A,db_LCA50!O:O)","v":3.65E-3},{"$f":"_xlfn.XLOOKUP($A63,db_LCA80!$A:$A,db_LCA80!O:O)","v":2.8500000000000001E-3},null,{"$f":"_xlfn.XLOOKUP($A63,db_LCA50!$A:$A,db_LCA50!R:R)","v":5.6900000000000001E-5},{"$f":"_xlfn.XLOOKUP($A63,db_LCA80!$A:$A,db_LCA80!R:R)","v":5.0500000000000001E-5},null,{"$f":"_xlfn.XLOOKUP($A63,db_LCA50!$A:$A,db_LCA50!U:U)","v":64.400000000000006},{"$f":"_xlfn.XLOOKUP($A63,db_LCA80!$A:$A,db_LCA80!U:U)","v":56.9},null,{"$f":"_xlfn.XLOOKUP($A63,db_LCA50!$A:$A,db_LCA50!X:X)","v":47.8},{"$f":"_xlfn.XLOOKUP($A63,db_LCA80!$A:$A,db_LCA80!X:X)","v":41.3},null,{"$f":"_xlfn.XLOOKUP($A63,db_LCA50!$A:$A,db_LCA50!AA:AA)","v":0.55200000000000005},{"$f":"_xlfn.XLOOKUP($A63,db_LCA80!$A:$A,db_LCA80!AA:AA)","v":0.36699999999999999}]
["R11",null,null,"lille","beton/cement","beton/cement",null,"beton/cement",null,"beton/cement","træ","tegl",null,"beton/cement",null,"træ","metal","træ",null,"tegl","tagpap",{"$f":"_xlfn.XLOOKUP(A64,db_LCA50!A:A,db_LCA50!C:C)","v":6.85},{"$f":"_xlfn.XLOOKUP($A64,db_LCA80!$A:$A,db_LCA80!C:C)","v":5.26},null,{"$f":"_xlfn.XLOOKUP($A64,db_LCA50!$A:$A,db_LCA50!F:F)","v":1.3400000000000001E-7},{"$f":"_xlfn.XLOOKUP($A64,db_LCA80!$A:$A,db_LCA80!F:F)","v":1.31E-7},null,{"$f":"_xlfn.XLOOKUP($A64,db_LCA50!$A:$A,db_LCA50!I:I)","v":1.7299999999999999E-2},{"$f":"_xlfn.XLOOKUP($A64,db_LCA80!$A:$A,db_LCA80!I:I)","v":1.3899999999999999E-2},null,{"$f":"_xlfn.XLOOKUP($A64,db_LCA50!$A:$A,db_LCA50!L:L)","v":2.3999999999999998E-3},{"$f":"_xlfn.XLOOKUP($A64,db_LCA80!$A:$A,db_LCA80!L:L)","v":1.8799999999999999E-3},null,{"$f":"_xlfn.XLOOKUP($A64,db_LCA50!$A:$A,db_LCA50!O:O)","v":3.7699999999999999E-3},{"$f":"_xlfn.XLOOKUP($A64,db_LCA80!$A:$A,db_LCA80!O:O)","v":3.0000000000000001E-3},null,{"$f":"_xlfn.XLOOKUP($A64,db_LCA50!$A:$A,db_LCA50!R:R)","v":7.2799999999999994E-5},{"$f":"_xlfn.XLOOKUP($A64,db_LCA80!$A:$A,db_LCA80!R:R)","v":6.2299999999999996E-5},null,{"$f":"_xlfn.XLOOKUP($A64,db_LCA50!$A:$A,db_LCA50!U:U)","v":72.900000000000006},{"$f":"_xlfn.XLOOKUP($A64,db_LCA80!$A:$A,db_LCA80!U:U)","v":57.4},null,{"$f":"_xlfn.XLOOKUP($A64,db_LCA50!$A:$A,db_LCA50!X:X)","v":36.4},{"$f":"_xlfn.XLOOKUP($A64,db_LCA80!$A:$A,db_LCA80!X:X)","v":27.4},null,{"$f":"_xlfn.XLOOKUP($A64,db_LCA50!$A:$A,db_LCA50!AA:AA)","v":0.90500000000000003},{"$f":"_xlfn.XLOOKUP($A64,db_LCA80!$A:$A,db_LCA80!AA:AA)","v":0.56999999999999995}]
["R12",null,null,"mellem","beton/cement","beton/cement",null,null,null,"træ",null,"træ",null,"beton/cement","metal","træ",null,"træ",null,"beton/cement",null,{"$f":"_xlfn.XLOOKUP(A65,db_LCA50!A:A,db_LCA50!C:C)","v":5.87},{"$f":"_xlfn.XLOOKUP($A65,db_LCA80!$A:$A,db_LCA80!C:C)","v":4.4400000000000004},null,{"$f":"_xlfn.XLOOKUP($A65,db_LCA50!$A:$A,db_LCA50!F:F)","v":4.8200000000000001E-8},{"$f":"_xlfn.XLOOKUP($A65,db_LCA80!$A:$A,db_LCA80!F:F)","v":3.3099999999999999E-8},null,{"$f":"_xlfn.XLOOKUP($A65,db_LCA50!$A:$A,db_LCA50!I:I)","v":1.7100000000000001E-2},{"$f":"_xlfn.XLOOKUP($A65,db_LCA80!$A:$A,db_LCA80!I:I)","v":1.3599999999999999E-2},null,{"$f":"_xlfn.XLOOKUP($A65,db_LCA50!$A:$A,db_LCA50!L:L)","v":2.5000000000000001E-3},{"$f":"_xlfn.XLOOKUP($A65,db_LCA80!$A:$A,db_LCA80!L:L)","v":1.9400000000000001E-3},null,{"$f":"_xlfn.XLOOKUP($A65,db_LCA50!$A:$A,db_LCA50!O:O)","v":4.4200000000000003E-3},{"$f":"_xlfn.XLOOKUP($A65,db_LCA80!$A:$A,db_LCA80!O:O)","v":3.0899999999999999E-3},null,{"$f":"_xlfn.XLOOKUP($A65,db_LCA50!$A:$A,db_LCA50!R:R)","v":2.1000000000000001E-4},{"$f":"_xlfn.XLOOKUP($A65,db_LCA80!$A:$A,db_LCA80!R:R)","v":1.7100000000000001E-4},null,{"$f":"_xlfn.XLOOKUP($A65,db_LCA50!$A:$A,db_LCA50!U:U)","v":62.1},{"$f":"_xlfn.XLOOKUP($A65,db_LCA80!$A:$A,db_LCA80!U:U)","v":48.3},null,{"$f":"_xlfn.XLOOKUP($A65,db_LCA50!$A:$A,db_LCA50!X:X)","v":30.6},{"$f":"_xlfn.XLOOKUP($A65,db_LCA80!$A:$A,db_LCA80!X:X)","v":23.6},null,{"$f":"_xlfn.XLOOKUP($A65,db_LCA50!$A:$A,db_LCA50!AA:AA)","v":0.86499999999999999},{"$f":"_xlfn.XLOOKUP($A65,db_LCA80!$A:$A,db_LCA80!AA:AA)","v":0.55500000000000005}]

{"sheet":"db_LCA50","index":3,"n_rows":62,"n_cols":28,"rows_kept":62,"cut":false,"hidden":true,"merged":[]}
["50år","GWP","kg CO2eq/m2/år",null,"ODP","kg R11-ækv/m2/år",null,"AP","kg SO2--ækv/m2/år",null,"EP","kg PO4--ækv/m2/år",null,"POCP","kg ethen--ækv/m2/år",null,"ADPe","kg Sb--ækv/m2/år",null,"ADPf","MJ/m2/år",null,"Petot","kWh/m2/år",null,"Sek","kWh/m2/år"]
[null,"Drift B6","Materialer A1-3, B4, C3-4","Alle faser\nA1-3, B4, B6, C3-4","Drift B6","Materialer A1-3, B4, C3-4","Alle faser\nA1-3, B4, B6, C3-4","Drift B6","Materialer A1-3, B4, C3-4","Alle faser\nA1-3, B4, B6, C3-4","Drift B6","Materialer A1-3, B4, C3-4","Alle faser\nA1-3, B4, B6, C3-4","Drift B6","Materialer A1-3, B4, C3-4","Alle faser\nA1-3, B4, B6, C3-4","Drift B6","Materialer A1-3, B4, C3-4","Alle faser\nA1-3, B4, B6, C3-4","Drift B6","Materialer A1-3, B4, C3-4","Alle faser\nA1-3, B4, B6, C3-4","Drift B6","Materialer A1-3, B4, C3-4","Alle faser\nA1-3, B4, B6, C3-4","Drift B6","Materialer A1-3, B4, C3-4","Alle faser\nA1-3, B4, B6, C3-4"]
["Enf01",3.08,6.16,9.24,2.4199999999999999E-10,3.8199999999999998E-8,3.8500000000000001E-8,1.34E-2,1.83E-2,3.1699999999999999E-2,2.6099999999999999E-3,2.16E-3,4.7600000000000003E-3,1.4E-3,3.2399999999999998E-3,4.64E-3,2.2499999999999999E-4,6.7899999999999997E-5,2.9300000000000002E-4,28.7,59.6,88.3,23.6,24.7,48.4,0.42,0.78100000000000003,1.2]
["Enf02",2.66,7.1,9.76,2.1199999999999999E-10,5.1599999999999999E-8,5.1900000000000002E-8,1.0999999999999999E-2,1.7399999999999999E-2,2.8400000000000002E-2,2.0799999999999998E-3,2.3500000000000001E-3,4.4200000000000003E-3,1.0399999999999999E-3,4.4600000000000004E-3,5.4999999999999997E-3,2.0100000000000001E-4,5.3399999999999997E-5,2.5399999999999999E-4,24.8,82.1,107,19.100000000000001,34.1,53.2,0.27200000000000002,0.79400000000000004,1.07]
["Enf03",2.38,5.79,8.17,1.95E-10,8.8699999999999994E-8,8.8899999999999995E-8,8.77E-3,2.5399999999999999E-2,3.4099999999999998E-2,1.5399999999999999E-3,3.5599999999999998E-3,5.11E-3,6.3299999999999999E-4,8.8900000000000003E-4,1.5200000000000001E-3,1.9000000000000001E-4,3.0200000000000002E-4,4.9200000000000003E-4,22.1,72.099999999999994,94.2,14.9,36.9,51.7,8.6699999999999999E-2,0.182,0.26900000000000002]
["Enf04",2.98,7.4,10.4,2.1899999999999999E-10,4.3800000000000002E-8,4.3999999999999997E-8,1.5800000000000002E-2,1.5800000000000002E-2,3.1600000000000003E-2,3.3600000000000001E-3,2.2100000000000002E-3,5.5700000000000003E-3,2.15E-3,5.3499999999999997E-3,7.4999999999999997E-3,1.8900000000000001E-4,9.7100000000000002E-5,2.8600000000000001E-4,28,80.3,108,28.9,33.1,62.1,0.82799999999999996,0.68799999999999994,1.52]
["Enf05",2.78,3.67,6.45,2.2300000000000001E-10,1.1300000000000001E-7,1.14E-7,1.12E-2,1.35E-2,2.47E-2,2.0999999999999999E-3,2.2399999999999998E-3,4.3400000000000001E-3,1.0200000000000001E-3,1.8400000000000001E-3,2.8500000000000001E-3,2.12E-4,8.5400000000000002E-5,2.9700000000000001E-4,25.9,41.5,67.400000000000006,19.5,34.1,53.6,0.248,0.32300000000000001,0.56999999999999995]
["Enf06",2.78,7.98,10.8,2.2300000000000001E-10,4.51E-8,4.5300000000000002E-8,1.12E-2,1.9300000000000001E-2,3.0499999999999999E-2,2.0999999999999999E-3,2.7100000000000002E-3,4.7999999999999996E-3,1.0200000000000001E-3,5.1000000000000004E-3,6.11E-3,2.12E-4,5.0899999999999997E-5,2.63E-4,25.9,91.4,117,19.5,35,54.4,0.248,0.65900000000000003,0.90700000000000003]
["Enf07",0.56399999999999995,7.62,8.18,2.33E-11,1.0700000000000001E-7,1.0700000000000001E-7,6.4799999999999996E-3,1.4800000000000001E-2,2.1299999999999999E-2,1.67E-3,1.9499999999999999E-3,3.62E-3,1.39E-3,6.9800000000000001E-3,8.3700000000000007E-3,3.1399999999999998E-7,6.7999999999999999E-5,6.8399999999999996E-5,5.48,87.3,92.8,13,38.6,51.6,0.67900000000000005,1.06,1.74]
["Enf08",2.89,9.36,12.2,2.2799999999999999E-10,1.85E-7,1.85E-7,1.24E-2,2.5399999999999999E-2,3.78E-2,2.3999999999999998E-3,3.3400000000000001E-3,5.7400000000000003E-3,1.2600000000000001E-3,7.6800000000000002E-3,8.94E-3,2.13E-4,5.3999999999999998E-5,2.6699999999999998E-4,27,99.1,126,21.8,41.1,62.9,0.36899999999999999,1.01,1.38]
["Enf09",1.46,6.6,8.07,1.15E-10,7.98E-8,8.0000000000000002E-8,6.43E-3,1.7299999999999999E-2,2.3800000000000002E-2,1.2600000000000001E-3,2.6900000000000001E-3,3.9500000000000004E-3,6.8000000000000005E-4,4.4400000000000004E-3,5.1200000000000004E-3,1.06E-4,5.1100000000000002E-5,1.5699999999999999E-4,13.7,74.599999999999994,88.3,11.4,38.200000000000003,49.5,0.20799999999999999,0.56699999999999995,0.77500000000000002]
["Enf10",2.72,8.52,11.2,2.17E-10,1.31E-7,1.3199999999999999E-7,1.11E-2,2.0899999999999998E-2,3.2000000000000001E-2,2.0799999999999998E-3,2.8400000000000001E-3,4.9199999999999999E-3,1.0300000000000001E-3,6.4999999999999997E-3,7.5199999999999998E-3,2.0599999999999999E-4,4.8900000000000003E-5,2.5500000000000002E-4,25.3,94.9,120,19.3,35.299999999999997,54.6,0.26,1.02,1.28]
["Enf11","-",9.1199999999999992,"-","-",1.18E-7,"-","-",2.41E-2,"-","-",3.16E-3,"-","-",7.11E-3,"-","-",2.4399999999999999E-4,"-","-",97.1,"-","-",46.4,"-","-",1.06,"-"]
["R01",0.221,8.17,8.39,9.1400000000000002E-12,1.33E-8,1.33E-8,2.5400000000000002E-3,2.98E-2,3.2300000000000002E-2,6.5399999999999996E-4,2.8600000000000001E-3,3.5200000000000001E-3,5.44E-4,4.0899999999999999E-3,4.6299999999999996E-3,1.23E-7,1.4899999999999999E-4,1.4899999999999999E-4,2.15,84.3,86.4,5.08,32.200000000000003,37.299999999999997,0.26600000000000001,0.77400000000000002,1.04]
["R02",2.78,7.44,10.199999999999999,2.2300000000000001E-10,3.5299999999999998E-8,3.5600000000000001E-8,1.12E-2,2.5499999999999998E-2,3.6700000000000003E-2,2.0999999999999999E-3,3.1199999999999999E-3,5.2199999999999998E-3,1.0200000000000001E-3,4.3400000000000001E-3,5.3499999999999997E-3,2.12E-4,2.7099999999999997E-4,4.8299999999999998E-4,25.9,82.4,108,19.5,36.299999999999997,55.8,0.248,0.45500000000000002,0.70299999999999996]
["R03",2.48,8.11,10.6,1.96E-10,9.7399999999999999E-9,9.9300000000000002E-9,1.04E-2,2.4400000000000002E-2,3.49E-2,2E-3,2.4199999999999998E-3,4.4099999999999999E-3,1.0300000000000001E-3,5.3E-3,6.3299999999999997E-3,1.84E-4,2.2900000000000001E-4,4.1300000000000001E-4,23.1,94.5,118,18.3,33.1,51.4,0.28799999999999998,0.75900000000000001,1.05]
["R04",3.36,10.8,14.2,2.3000000000000001E-10,1.4E-8,1.42E-8,8.43E-3,3.1300000000000001E-2,3.9699999999999999E-2,1.2999999999999999E-3,3.0100000000000001E-3,4.3099999999999996E-3,2.8699999999999998E-4,6.6400000000000001E-3,6.9300000000000004E-3,2.31E-4,1.6899999999999999E-4,4.0000000000000002E-4,25.1,109,134,13.6,39.200000000000003,52.8,-0.13100000000000001,1.61,1.48]
["R05",3.7,10.8,14.5,2.5999999999999998E-10,1.7599999999999999E-8,1.7900000000000001E-8,0.01,0.03,0.04,1.6000000000000001E-3,2.9199999999999999E-3,4.5199999999999997E-3,4.3199999999999998E-4,7.5799999999999999E-3,8.0099999999999998E-3,2.5999999999999998E-4,1.8000000000000001E-4,4.4099999999999999E-4,28.6,119,147,16.3,45.8,62.2,-9.4299999999999995E-2,1.28,1.19]
["R06",2.16,4.42,6.58,1.71E-10,4.5900000000000001E-8,4.6000000000000002E-8,9.1699999999999993E-3,1.1299999999999999E-2,2.0500000000000001E-2,1.7600000000000001E-3,1.6999999999999999E-3,3.46E-3,9.1500000000000001E-4,3.4199999999999999E-3,4.3400000000000001E-3,1.6000000000000001E-4,1.63E-4,3.2299999999999999E-4,20.2,45.2,65.3,16.100000000000001,28.7,44.8,0.26,0.56899999999999995,0.82899999999999996]
["R07",2.77,5.8,8.57,2.16E-10,3.6400000000000002E-8,3.6599999999999997E-8,1.23E-2,1.37E-2,2.5999999999999999E-2,2.4099999999999998E-3,1.98E-3,4.4000000000000003E-3,1.32E-3,5.3099999999999996E-3,6.6299999999999996E-3,2.0000000000000001E-4,5.0899999999999997E-5,2.5099999999999998E-4,25.9,72.599999999999994,98.5,21.8,28.6,50.4,0.41199999999999998,0.22800000000000001,0.63900000000000001]
["R08",2.6,7.39,9.99,2.0700000000000001E-10,8.6400000000000006E-8,8.6599999999999995E-8,1.0699999999999999E-2,1.67E-2,2.7300000000000001E-2,2.0100000000000001E-3,2.1700000000000001E-3,4.1700000000000001E-3,9.9599999999999992E-4,3.9199999999999999E-3,4.9199999999999999E-3,1.9599999999999999E-4,7.1000000000000005E-5,2.6699999999999998E-4,24.2,72.5,96.7,18.5,27.4,45.9,0.25700000000000001,1.53,1.78]
["R09",2.5499999999999998,6.13,8.67,2.1E-10,6.2299999999999995E-8,6.2499999999999997E-8,9.1900000000000003E-3,1.6400000000000001E-2,2.5600000000000001E-2,1.5900000000000001E-3,2.3800000000000002E-3,3.98E-3,6.2200000000000005E-4,3.5799999999999998E-3,4.1999999999999997E-3,2.05E-4,1.17E-4,3.2200000000000002E-4,23.7,67.3,90.9,15.5,36.4,51.9,6.3500000000000001E-2,0.58599999999999997,0.64900000000000002]
["R10",2.6,5.9,8.5,2.0700000000000001E-10,1.05E-7,1.05E-7,1.0699999999999999E-2,1.7899999999999999E-2,2.8500000000000001E-2,2.0100000000000001E-3,2.7899999999999999E-3,4.7999999999999996E-3,9.9599999999999992E-4,3.65E-3,4.6499999999999996E-3,1.9599999999999999E-4,5.6900000000000001E-5,2.5300000000000002E-4,24.2,64.400000000000006,88.6,18.5,47.8,66.400000000000006,0.25700000000000001,0.55200000000000005,0.80800000000000005]
["R11",2.78,6.85,9.6300000000000008,2.2200000000000001E-10,1.3400000000000001E-7,1.3400000000000001E-7,1.1299999999999999E-2,1.7299999999999999E-2,2.86E-2,2.1199999999999999E-3,2.3999999999999998E-3,4.5199999999999997E-3,1.0399999999999999E-3,3.7699999999999999E-3,4.81E-3,2.1100000000000001E-4,7.2799999999999994E-5,2.8400000000000002E-4,25.9,72.900000000000006,98.8,19.7,36.4,56.1,0.26100000000000001,0.90500000000000003,1.17]
["R12",4.58,5.87,10.5,3.89E-10,4.8200000000000001E-8,4.8599999999999998E-8,1.4200000000000001E-2,1.7100000000000001E-2,3.1300000000000001E-2,2.1800000000000001E-3,2.5000000000000001E-3,4.6800000000000001E-3,4.6200000000000001E-4,4.4200000000000003E-3,4.8799999999999998E-3,3.9300000000000001E-4,2.1000000000000001E-4,6.0300000000000002E-4,42.5,62.1,105,22.8,30.6,53.4,-0.23499999999999999,0.86499999999999999,0.63]
["E01",1.91,6.95,8.86,1.5199999999999999E-10,2.2700000000000001E-8,2.29E-8,8.0000000000000002E-3,1.78E-2,2.58E-2,1.5200000000000001E-3,2.0400000000000001E-3,3.5599999999999998E-3,7.7700000000000002E-4,2.81E-3,3.5899999999999999E-3,1.4300000000000001E-4,1.1E-4,2.5300000000000002E-4,17.8,64.3,82.1,14,24.1,38.1,0.21199999999999999,1.74,1.95]
["E02",1.92,7.05,8.9600000000000009,1.5299999999999999E-10,1.13E-8,1.14E-8,7.8399999999999997E-3,1.55E-2,2.3300000000000001E-2,1.47E-3,1.9499999999999999E-3,3.4299999999999999E-3,7.2999999999999996E-4,4.4099999999999999E-3,5.1399999999999996E-3,1.45E-4,6.2899999999999997E-5,2.0799999999999999E-4,17.899999999999999,62.6,80.400000000000006,13.6,21.9,35.6,0.187,1.88,2.0699999999999998]
["E03",2.37,6.32,8.68,1.9100000000000001E-10,1.4899999999999999E-8,1.4999999999999999E-8,9.3299999999999998E-3,1.5100000000000001E-2,2.4400000000000002E-2,1.7099999999999999E-3,2.0999999999999999E-3,3.81E-3,7.9799999999999999E-4,2.5200000000000001E-3,3.32E-3,1.83E-4,7.2200000000000007E-5,2.5500000000000002E-4,22.1,50.4,72.400000000000006,16.100000000000001,17.3,33.4,0.17599999999999999,2.08,2.25]
["E04",2.19,7.03,9.2100000000000009,1.7800000000000001E-10,1.2499999999999999E-8,1.26E-8,8.3499999999999998E-3,1.8800000000000001E-2,2.7099999999999999E-2,1.5E-3,2.5300000000000001E-3,4.0400000000000002E-3,6.6299999999999996E-4,2.0799999999999998E-3,2.7499999999999998E-3,1.7100000000000001E-4,7.9900000000000004E-5,2.5099999999999998E-4,20.3,58.1,78.5,14.3,22.8,37.1,0.123,2.02,2.15]
["E05",1.3,8.8000000000000007,10.1,1.12E-10,2.1900000000000001E-8,2.1999999999999998E-8,3.7399999999999998E-3,1.77E-2,2.1499999999999998E-2,5.31E-4,2.4599999999999999E-3,2.99E-3,4.6600000000000001E-5,3.5799999999999998E-3,3.63E-3,1.15E-4,1.34E-4,2.4899999999999998E-4,12.1,71.2,83.3,5.85,25.5,31.4,-0.112,2.8,2.69]
["E06",2.91,9.17,12.1,2.2799999999999999E-10,4.9200000000000004E-9,5.1499999999999998E-9,1.2800000000000001E-2,2.1899999999999999E-2,3.4799999999999998E-2,2.5000000000000001E-3,2.65E-3,5.1599999999999997E-3,1.3600000000000001E-3,2.2399999999999998E-3,3.5999999999999999E-3,2.12E-4,5.9599999999999996E-4,8.0800000000000002E-4,27.2,89.5,117,22.6,33.200000000000003,55.8,0.41499999999999998,1.41,1.82]
["E07",1.95,5.14,7.09,1.5299999999999999E-10,1.0700000000000001E-7,1.0700000000000001E-7,8.4100000000000008E-3,1.5699999999999999E-2,2.41E-2,1.6299999999999999E-3,2.3600000000000001E-3,3.98E-3,8.6300000000000005E-4,2.1299999999999999E-3,2.99E-3,1.4300000000000001E-4,1.6200000000000001E-4,3.0499999999999999E-4,18.2,58.4,76.599999999999994,14.8,36.6,51.4,0.254,0.69499999999999995,0.95]
["E08",2.3199999999999998,8.61,10.9,1.9100000000000001E-10,1.15E-8,1.1700000000000001E-8,8.3700000000000007E-3,2.06E-2,2.8899999999999999E-2,1.4499999999999999E-3,2.3800000000000002E-3,3.8300000000000001E-3,5.6700000000000001E-4,6.0899999999999999E-3,6.6600000000000001E-3,1.8699999999999999E-4,2.3599999999999999E-4,4.2299999999999998E-4,21.6,84.2,106,14.1,29.4,43.5,5.7799999999999997E-2,1.76,1.82]
["E09",2.31,6.64,8.9499999999999993,1.79E-10,9.6699999999999999E-9,9.8500000000000005E-9,1.04E-2,1.47E-2,2.5100000000000001E-2,2.0699999999999998E-3,1.91E-3,3.98E-3,1.15E-3,3.31E-3,4.47E-3,1.65E-4,7.8499999999999997E-5,2.43E-4,21.6,63.3,84.8,18.5,21.2,39.799999999999997,0.371,1.43,1.8]
["E10",2.0699999999999998,7.97,10,1.6799999999999999E-10,2.4699999999999999E-8,2.4900000000000001E-8,7.9799999999999992E-3,1.6899999999999998E-2,2.4899999999999999E-2,1.4499999999999999E-3,2.2699999999999999E-3,3.7100000000000002E-3,6.4800000000000003E-4,2.3999999999999998E-3,3.0400000000000002E-3,1.6200000000000001E-4,6.6400000000000001E-5,2.2800000000000001E-4,19.3,66.8,86.1,13.7,24.1,37.799999999999997,0.127,2.37,2.5]
["E11",2.0699999999999998,8.77,10.8,1.6799999999999999E-10,5.0600000000000003E-8,5.0799999999999998E-8,7.9799999999999992E-3,2.2100000000000002E-2,0.03,1.4499999999999999E-3,2.5699999999999998E-3,4.0200000000000001E-3,6.4800000000000003E-4,3.0100000000000001E-3,3.6600000000000001E-3,1.6200000000000001E-4,5.7599999999999997E-5,2.1900000000000001E-4,19.3,89,108,13.7,32.5,46.2,0.127,1.93,2.06]
["K01",2.38,7.14,9.52,1.8299999999999999E-10,8.6200000000000004E-9,8.7999999999999994E-9,1.12E-2,2.0899999999999998E-2,3.2000000000000001E-2,2.2499999999999998E-3,2.3600000000000001E-3,4.6100000000000004E-3,1.2999999999999999E-3,3.64E-3,4.9399999999999999E-3,1.66E-4,3.2200000000000002E-4,4.8799999999999999E-4,22.3,67.900000000000006,90.2,20,24.8,44.8,0.443,1.1299999999999999,1.57]
["K02",2.0299999999999998,6.09,8.11,1.4800000000000001E-10,1.15E-8,1.16E-8,1.0999999999999999E-2,1.38E-2,2.4799999999999999E-2,2.3500000000000001E-3,1.7700000000000001E-3,4.1200000000000004E-3,1.5299999999999999E-3,2.5000000000000001E-3,4.0200000000000001E-3,1.26E-4,1.1E-4,2.3599999999999999E-4,19,45.8,64.8,20.2,19.600000000000001,39.799999999999997,0.59899999999999998,2.25,2.85]
["K03",1.82,8.1300000000000008,9.94,1.3300000000000001E-10,6.9800000000000003E-8,7.0000000000000005E-8,9.8099999999999993E-3,2.2100000000000002E-2,3.1899999999999998E-2,2.0999999999999999E-3,2.49E-3,4.5900000000000003E-3,1.3600000000000001E-3,3.0200000000000001E-3,4.3800000000000002E-3,1.13E-4,8.1799999999999996E-5,1.95E-4,17.100000000000001,78.599999999999994,95.7,18,26.6,44.6,0.53200000000000003,1.76,2.29]
["K04",1.68,6.68,8.36,1.26E-10,1.04E-8,1.05E-8,8.4399999999999996E-3,1.44E-2,2.2800000000000001E-2,1.7600000000000001E-3,1.7600000000000001E-3,3.5100000000000001E-3,1.08E-3,4.3600000000000002E-3,5.4400000000000004E-3,1.11E-4,3.27,3.27,15.7,60.6,76.3,15.3,20.399999999999999,35.700000000000003,0.39800000000000002,1.58,1.98]
["K05",2.06,8.64,10.7,1.5199999999999999E-10,2.2700000000000001E-8,2.29E-8,1.0699999999999999E-2,2.81E-2,3.8800000000000001E-2,2.2599999999999999E-3,3.2499999999999999E-3,5.5100000000000001E-3,1.4300000000000001E-3,3.0100000000000001E-3,4.4400000000000004E-3,1.3200000000000001E-4,2.8499999999999999E-4,4.17E-4,19.3,90.3,110,19.600000000000001,34.799999999999997,54.4,0.54500000000000004,1.39,1.94]
["K06",1.64,6.26,7.9,1.15E-10,1.04E-8,1.05E-8,9.7199999999999995E-3,1.6799999999999999E-2,2.6499999999999999E-2,2.15E-3,1.82E-3,3.98E-3,1.47E-3,2.9499999999999999E-3,4.4200000000000003E-3,9.3399999999999993E-5,1.7200000000000001E-4,2.6499999999999999E-4,15.4,64.8,80.2,18.100000000000001,22.9,41,0.61,1.0900000000000001,1.7]
["K07",2.11,10.3,12.4,1.5899999999999999E-10,1.9399999999999998E-8,1.96E-8,1.0500000000000001E-2,2.1899999999999999E-2,3.2399999999999998E-2,2.16E-3,2.7899999999999999E-3,4.96E-3,1.32E-3,1.4200000000000001E-2,1.5599999999999999E-2,1.4100000000000001E-4,1.06E-4,2.4699999999999999E-4,19.8,102,122,18.899999999999999,34,52.9,0.47799999999999998,2.25,2.73]
["K08",2.65,8.9600000000000009,11.6,1.8899999999999999E-10,9.3700000000000005E-9,9.5499999999999995E-9,1.52E-2,2.7E-2,4.2200000000000001E-2,3.3300000000000001E-3,3.46E-3,6.7799999999999996E-3,2.2300000000000002E-3,6.2100000000000002E-3,8.4399999999999996E-3,1.56E-4,1.6699999999999999E-4,3.2400000000000001E-4,24.9,97.4,122,28.2,36.200000000000003,64.400000000000006,0.90900000000000003,0.79600000000000004,1.71]
["K09",1.91,7.84,9.75,1.35E-10,9.2900000000000008E-9,9.4199999999999993E-9,1.12E-2,2.07E-2,3.1899999999999998E-2,2.4599999999999999E-3,2.8400000000000001E-3,5.3E-3,1.67E-3,2.9499999999999999E-3,4.6100000000000004E-3,1.11E-4,2.2900000000000001E-4,3.39E-4,18,73.3,91.3,20.8,27.1,47.9,0.68500000000000005,1.62,2.31]
["K10",2.14,10.8,13,1.51E-10,2.0599999999999999E-8,2.0800000000000001E-8,1.2500000000000001E-2,2.7900000000000001E-2,4.0500000000000001E-2,2.7599999999999999E-3,3.6600000000000001E-3,6.43E-3,1.8799999999999999E-3,5.2199999999999998E-3,7.1000000000000004E-3,1.2300000000000001E-4,2.3900000000000001E-4,3.6200000000000002E-4,20.100000000000001,115,136,23.3,39.6,62.9,0.77300000000000002,1.71,2.48]
["K11",1.42,5.32,6.75,8.6699999999999995E-11,1.9000000000000001E-8,1.9099999999999999E-8,1.0999999999999999E-2,1.2999999999999999E-2,2.4E-2,2.63E-3,1.6900000000000001E-3,4.3200000000000001E-3,2E-3,1.32E-3,3.32E-3,5.5099999999999998E-5,3.6699999999999998E-5,9.1899999999999998E-5,13.6,44.4,58,21.3,16.399999999999999,37.700000000000003,0.91400000000000003,1.62,2.54]
["K12",2.66,6.41,9.07,1.94E-10,5.9099999999999997E-9,6.1E-9,1.4500000000000001E-2,1.8700000000000001E-2,3.3099999999999997E-2,3.0999999999999999E-3,2.8300000000000001E-3,5.9300000000000004E-3,2.0200000000000001E-3,2.2200000000000002E-3,4.2399999999999998E-3,1.65E-4,1.2300000000000001E-4,2.8699999999999998E-4,25,61.4,86.4,26.6,20.2,46.8,0.79300000000000004,1.17,1.97]
["K13",1.83,4.8600000000000003,6.69,1.3200000000000001E-10,5.93E-9,6.0699999999999999E-9,1.0200000000000001E-2,1.3299999999999999E-2,2.3400000000000001E-2,2.2000000000000001E-3,1.67E-3,3.8700000000000002E-3,1.4499999999999999E-3,2.4599999999999999E-3,3.9199999999999999E-3,1.11E-4,1.03E-4,2.14E-4,17.2,43.5,60.6,18.8,16.600000000000001,35.4,0.57999999999999996,1.06,1.64]
["K14",1.82,7.75,9.56,1.2899999999999999E-10,1.24E-8,1.26E-8,1.06E-2,1.6299999999999999E-2,2.69E-2,2.33E-3,2.1800000000000001E-3,4.5199999999999997E-3,1.58E-3,7.4400000000000004E-3,9.0200000000000002E-3,1.05E-4,6.9499999999999995E-5,1.75E-4,17.100000000000001,79.5,96.6,19.7,26.3,46,0.64900000000000002,1.45,2.1]
["K15",2.2599999999999998,6.58,8.84,1.6900000000000001E-10,1.1700000000000001E-8,1.18E-8,1.15E-2,1.49E-2,2.64E-2,2.3900000000000002E-3,1.8600000000000001E-3,4.2599999999999999E-3,1.48E-3,4.3200000000000001E-3,5.7999999999999996E-3,1.4899999999999999E-4,7.9599999999999997E-5,2.2800000000000001E-4,21.2,59.2,80.400000000000006,20.8,20.399999999999999,41.3,0.55000000000000004,1.67,2.2200000000000002]
["K16",1.68,6.7,8.3699999999999992,1.19E-10,9.7900000000000003E-9,9.9100000000000007E-9,9.7199999999999995E-3,1.7100000000000001E-2,2.69E-2,2.14E-3,2.3999999999999998E-3,4.5300000000000002E-3,1.4400000000000001E-3,3.48E-3,4.9199999999999999E-3,9.7999999999999997E-5,9.48E-5,1.93E-4,15.8,60,75.8,18.100000000000001,22.2,40.299999999999997,0.59,1.4,1.99]
["K17",2.61,6.98,9.59,1.81E-10,9.6400000000000006E-9,9.8199999999999996E-9,1.6E-2,1.5900000000000001E-2,3.1899999999999998E-2,3.5899999999999999E-3,2.2200000000000002E-3,5.8100000000000001E-3,2.5000000000000001E-3,5.6499999999999996E-3,8.1499999999999993E-3,1.4300000000000001E-4,9.4599999999999996E-5,2.3800000000000001E-4,24.6,70,94.6,30,26.9,56.9,1.05,1.36,2.42]
["K18",1.49,10.3,11.8,6.1599999999999999E-11,8.4499999999999996E-9,8.5099999999999998E-9,1.7100000000000001E-2,2.4500000000000001E-2,4.1599999999999998E-2,4.4000000000000003E-3,3.0400000000000002E-3,7.4400000000000004E-3,3.6700000000000001E-3,4.2399999999999998E-3,7.9100000000000004E-3,8.2799999999999995E-7,7.5400000000000003E-5,7.6199999999999995E-5,14.5,85.6,100,34.200000000000003,31.2,65.5,1.79,2.82,4.6100000000000003]
["K19",2.21,6.9,9.11,1.5500000000000001E-10,3.6500000000000003E-8,3.6599999999999997E-8,1.3299999999999999E-2,1.6E-2,2.93E-2,2.9499999999999999E-3,2.2599999999999999E-3,5.1999999999999998E-3,2.0200000000000001E-3,3.2000000000000002E-3,5.2300000000000003E-3,1.25E-4,1.83E-4,3.0800000000000001E-4,20.9,56.1,76.900000000000006,24.8,22.7,47.5,0.84399999999999997,2.12,2.97]
["K20",2.02,8.5299999999999994,10.6,1.43E-10,1.9099999999999999E-8,1.92E-8,1.17E-2,2.3300000000000001E-2,3.5000000000000003E-2,2.5699999999999998E-3,3.47E-3,6.0400000000000002E-3,1.73E-3,2.7799999999999999E-3,4.5100000000000001E-3,1.18E-4,1.06E-4,2.24E-4,19,82.5,102,21.7,27.6,49.3,0.70799999999999996,2.21,2.91]
["K21",2.3199999999999998,6.46,8.77,1.64E-10,1.03E-8,1.05E-8,1.35E-2,1.4800000000000001E-2,2.8299999999999999E-2,2.97E-3,1.91E-3,4.8799999999999998E-3,2.0100000000000001E-3,2.9399999999999999E-3,4.9500000000000004E-3,1.35E-4,9.09E-5,2.2599999999999999E-4,21.8,54.1,75.900000000000006,25.1,18.7,43.8,0.82599999999999996,1.92,2.75]
["K22",1.87,5.8,7.67,1.3300000000000001E-10,8.2200000000000002E-9,8.3600000000000001E-9,1.09E-2,1.47E-2,2.5600000000000001E-2,2.3900000000000002E-3,1.91E-3,4.3E-3,1.6199999999999999E-3,2.2399999999999998E-3,3.8500000000000001E-3,1.0900000000000001E-4,1.92E-4,3.01E-4,17.600000000000001,55,72.599999999999994,20.2,20.399999999999999,40.700000000000003,0.66400000000000003,1.28,1.94]
["A05",2.9,6.62,9.52,2.1500000000000001E-10,2.6400000000000001E-8,2.66E-8,1.4999999999999999E-2,2.1399999999999999E-2,3.6400000000000002E-2,3.16E-3,2.8500000000000001E-3,6.0099999999999997E-3,1.99E-3,2.5500000000000002E-3,4.5399999999999998E-3,1.8799999999999999E-4,2.81E-4,4.6900000000000002E-4,27.2,71.8,99,27.4,30,57.4,0.751,0.56899999999999995,1.32]
["A06",2.9,6.25,9.15,2.1500000000000001E-10,2.66E-8,2.6799999999999998E-8,1.4999999999999999E-2,2.0400000000000001E-2,3.5400000000000001E-2,3.16E-3,2.8800000000000002E-3,6.0400000000000002E-3,1.99E-3,2.4399999999999999E-3,4.4299999999999999E-3,1.8799999999999999E-4,2.81E-4,4.6900000000000002E-4,27.2,71.7,98.9,27.4,33.200000000000003,60.6,0.751,0.42899999999999999,1.18]
["A07",2.2200000000000002,10.1,12.3,1.66E-10,1.3399999999999999E-8,1.35E-8,1.12E-2,2.9700000000000001E-2,4.0899999999999999E-2,2.3400000000000001E-3,3.0599999999999998E-3,5.4000000000000003E-3,1.4499999999999999E-3,3.79E-3,5.2399999999999999E-3,1.46E-4,7.2000000000000002E-5,2.1800000000000001E-4,20.8,94.8,116,20.399999999999999,37.200000000000003,57.6,0.53500000000000003,1.47,2.0099999999999998]
["A08",2.23,7.61,9.84,1.66E-10,1.05E-8,1.0600000000000001E-8,1.1599999999999999E-2,1.9599999999999999E-2,3.1099999999999999E-2,2.4399999999999999E-3,2.5400000000000002E-3,4.9800000000000001E-3,1.5399999999999999E-3,2.8500000000000001E-3,4.3899999999999998E-3,1.44E-4,9.2499999999999999E-5,2.3699999999999999E-4,21,69.099999999999994,90,21.2,24.1,45.3,0.58399999999999996,1.73,2.3199999999999998]

{"sheet":"db_LCA80","index":4,"n_rows":62,"n_cols":28,"rows_kept":62,"cut":false,"hidden":true,"merged":[]}
["80år","GWP","kg CO2eq/m2/år",null,"ODP","kg R11-ækv/m2/år",null,"AP","kg SO2--ækv/m2/år",null,"EP","kg PO4--ækv/m2/år",null,"POCP","kg ethen--ækv/m2/år",null,"ADPe","kg Sb--ækv/m2/år",null,"ADPf","MJ/m2/år",null,"Petot","kWh/m2/år",null,"Sek","kWh/m2/år"]
[null,"Drift B6","Materialer A1-3, B4, C3-4","Alle faser\nA1-3, B4, B6, C3-4","Drift B6","Materialer A1-3, B4, C3-4","Alle faser\nA1-3, B4, B6, C3-4","Drift B6","Materialer A1-3, B4, C3-4","Alle faser\nA1-3, B4, B6, C3-4","Drift B6","Materialer A1-3, B4, C3-4","Alle faser\nA1-3, B4, B6, C3-4","Drift B6","Materialer A1-3, B4, C3-4","Alle faser\nA1-3, B4, B6, C3-4","Drift B6","Materialer A1-3, B4, C3-4","Alle faser\nA1-3, B4, B6, C3-4","Drift B6","Materialer A1-3, B4, C3-4","Alle faser\nA1-3, B4, B6, C3-4","Drift B6","Materialer A1-3, B4, C3-4","Alle faser\nA1-3, B4, B6, C3-4","Drift B6","Materialer A1-3, B4, C3-4","Alle faser\nA1-3, B4, B6, C3-4"]
["Enf01",2.82,4.95,7.77,2.2900000000000001E-10,2.6000000000000001E-8,2.62E-8,1.15E-2,1.4500000000000001E-2,2.5999999999999999E-2,2.2499999999999998E-3,1.7700000000000001E-3,4.0200000000000001E-3,1.14E-3,2.3400000000000001E-3,3.48E-3,2.1499999999999999E-4,5.1900000000000001E-5,2.6699999999999998E-4,25.9,50.4,76.3,21.5,19.899999999999999,41.5,0.41199999999999998,0.504,0.91700000000000004]
["Enf02",2.4500000000000002,5.19,7.64,2.01E-10,3.2299999999999998E-8,3.25E-8,9.4400000000000005E-3,1.2800000000000001E-2,2.2200000000000001E-2,1.8E-3,1.74E-3,3.5400000000000002E-3,8.4900000000000004E-4,2.96E-3,3.81E-3,1.92E-4,5.3900000000000002E-5,2.4600000000000002E-4,22.4,61.1,83.5,17.399999999999999,24.4,41.8,0.26800000000000002,0.496,0.76400000000000001]
["Enf03",2.21,4.5599999999999996,6.76,1.8500000000000001E-10,7.6500000000000003E-8,7.6700000000000005E-8,7.5199999999999998E-3,1.95E-2,2.7E-2,1.3600000000000001E-3,2.8400000000000001E-3,4.1999999999999997E-3,5.22E-4,9.59E-4,1.48E-3,1.8100000000000001E-4,2.02E-4,3.8299999999999999E-4,20.100000000000001,56.3,76.400000000000006,13.3,29.9,43.2,8.5800000000000001E-2,0.121,0.20699999999999999]
["Enf04",2.67,6.26,8.94,2.0800000000000001E-10,4.3800000000000002E-8,4.3999999999999997E-8,1.3599999999999999E-2,1.2699999999999999E-2,2.63E-2,2.8500000000000001E-3,1.82E-3,4.6699999999999997E-3,1.74E-3,3.6900000000000001E-3,5.4299999999999999E-3,1.8100000000000001E-4,6.8800000000000005E-5,2.4899999999999998E-4,24.7,67.900000000000006,92.6,26.8,28.7,55.4,0.81299999999999994,0.43,1.24]
["Enf05",2.56,3.11,5.67,2.11E-10,7.1499999999999998E-8,7.17E-8,9.6500000000000006E-3,1.11E-2,2.0799999999999999E-2,1.82E-3,1.72E-3,3.5400000000000002E-3,8.3100000000000003E-4,1.5E-3,2.33E-3,2.03E-4,7.1899999999999999E-5,2.7500000000000002E-4,23.5,35.799999999999997,59.3,17.600000000000001,25,42.6,0.24399999999999999,0.22700000000000001,0.47099999999999997]
["Enf06",2.56,5.82,8.3800000000000008,2.11E-10,4.36E-8,4.3800000000000002E-8,9.6500000000000006E-3,1.5299999999999999E-2,2.4899999999999999E-2,1.82E-3,2.1700000000000001E-3,3.9899999999999996E-3,8.3100000000000003E-4,3.5599999999999998E-3,4.3899999999999998E-3,2.03E-4,4.4499999999999997E-5,2.4699999999999999E-4,23.5,66.5,90,17.600000000000001,26.8,44.4,0.24399999999999999,0.45600000000000002,0.7]
["Enf07",0.44,6.61,7.05,2.2200000000000002E-11,1.2200000000000001E-7,1.2200000000000001E-7,5.62E-3,1.29E-2,1.8499999999999999E-2,1.3699999999999999E-3,1.66E-3,3.0300000000000001E-3,1.1199999999999999E-3,5.2500000000000003E-3,6.3699999999999998E-3,3.2000000000000001E-7,6.3700000000000003E-5,6.41E-5,4.34,80.900000000000006,85.2,12.4,37.799999999999997,50.1,0.66600000000000004,0.67400000000000004,1.34]
["Enf08",2.65,8.5399999999999991,11.2,2.16E-10,1.99E-7,1.99E-7,1.0699999999999999E-2,2.4400000000000002E-2,3.5099999999999999E-2,2.0699999999999998E-3,3.1199999999999999E-3,5.1900000000000002E-3,1.0300000000000001E-3,6.0600000000000003E-3,7.0899999999999999E-3,2.03E-4,5.1900000000000001E-5,2.5500000000000002E-4,24.3,93.4,118,19.899999999999999,36.799999999999997,56.7,0.36299999999999999,0.63900000000000001,1]
["Enf09",1.34,5.53,6.86,1.09E-10,5.2100000000000003E-8,5.2199999999999998E-8,5.5300000000000002E-3,1.49E-2,2.0400000000000001E-2,1.08E-3,2.2699999999999999E-3,3.3600000000000001E-3,5.5400000000000002E-4,3.1700000000000001E-3,3.7200000000000002E-3,1.02E-4,4.2599999999999999E-5,1.44E-4,12.3,63.8,76.099999999999994,10.4,30.5,40.799999999999997,0.20399999999999999,0.36,0.56399999999999995]
["Enf10",2.5,6.76,9.26,2.0600000000000001E-10,1.48E-7,1.48E-7,9.5200000000000007E-3,1.7999999999999999E-2,2.75E-2,1.81E-3,2.4599999999999999E-3,4.2700000000000004E-3,8.3799999999999999E-4,4.8199999999999996E-3,5.6600000000000001E-3,1.9699999999999999E-4,4.2899999999999999E-5,2.4000000000000001E-4,22.9,76.7,99.6,17.5,29.1,46.6,0.255,0.64700000000000002,0.90200000000000002]
["Enf11","-",7.3,"-","-",1.12E-7,"-","-",2.0299999999999999E-2,"-","-",2.5699999999999998E-3,"-","-",5.4999999999999997E-3,"-","-",2.24E-4,"-","-",80,"-","-",38,"-","-",0.66600000000000004,"-"]
["R01",0.17199999999999999,6.47,6.64,8.6999999999999997E-12,8.6699999999999992E-9,8.6800000000000006E-9,2.2000000000000001E-3,2.24E-2,2.46E-2,5.3700000000000004E-4,2.2499999999999998E-3,2.7899999999999999E-3,4.37E-4,3.13E-3,3.5599999999999998E-3,1.2499999999999999E-7,1.36E-4,1.36E-4,1.7,70.2,71.900000000000006,4.8499999999999996,27.3,32.200000000000003,0.26100000000000001,0.48799999999999999,0.749]
["R02",2.56,6.37,8.93,2.11E-10,2.2600000000000001E-8,2.2799999999999999E-8,9.6500000000000006E-3,2.18E-2,3.15E-2,1.82E-3,2.65E-3,4.47E-3,8.3100000000000003E-4,3.3300000000000001E-3,4.1599999999999996E-3,2.03E-4,2.2499999999999999E-4,4.2700000000000002E-4,23.5,71.7,95.2,17.600000000000001,29.7,47.3,0.24399999999999999,0.30599999999999999,0.55000000000000004]
["R03",2.27,6.72,8.99,1.86E-10,6.89E-9,7.0800000000000004E-9,8.9800000000000001E-3,1.9800000000000002E-2,2.87E-2,1.73E-3,1.9300000000000001E-3,3.6600000000000001E-3,8.4099999999999995E-4,3.7299999999999998E-3,4.5700000000000003E-3,1.76E-4,1.8599999999999999E-4,3.6200000000000002E-4,20.8,80.3,101,16.600000000000001,27.8,44.4,0.28299999999999997,0.47799999999999998,0.76100000000000001]
["R04",2.54,9.06,11.6,2.18E-10,1.35E-8,1.37E-8,7.2100000000000003E-3,2.47E-2,3.1899999999999998E-2,1.1800000000000001E-3,2.48E-3,3.6600000000000001E-3,2.4699999999999999E-4,5.2399999999999999E-3,5.4799999999999996E-3,2.2100000000000001E-4,1.66E-4,3.8699999999999997E-4,23,96.7,120,11.9,35.5,47.5,-0.128,1.05,0.92400000000000004]
["R05",2.89,9.5,12.4,2.4699999999999997E-10,1.5300000000000001E-8,1.5600000000000001E-8,8.5599999999999999E-3,2.4199999999999999E-2,3.2800000000000003E-2,1.4400000000000001E-3,2.47E-3,3.9100000000000003E-3,3.6699999999999998E-4,7.1399999999999996E-3,7.4999999999999997E-3,2.4899999999999998E-4,1.84E-4,4.3300000000000001E-4,26.3,111,137,14.4,43.5,57.9,-9.1399999999999995E-2,0.83799999999999997,0.746]
["R06",1.98,3.6,5.59,1.6200000000000001E-10,2.88E-8,2.9000000000000002E-8,7.8799999999999999E-3,9.1800000000000007E-3,1.7100000000000001E-2,1.5200000000000001E-3,1.3500000000000001E-3,2.8700000000000002E-3,7.4700000000000005E-4,2.5500000000000002E-3,3.29E-3,1.5300000000000001E-4,1.12E-4,2.6499999999999999E-4,18.2,38,56.1,14.6,24,38.6,0.255,0.35699999999999998,0.61199999999999999]
["R07",2.5299999999999998,5.42,7.95,2.0499999999999999E-10,2.77E-8,2.7899999999999998E-8,1.06E-2,1.2500000000000001E-2,2.3099999999999999E-2,2.0799999999999998E-3,1.8400000000000001E-3,3.9199999999999999E-3,1.08E-3,3.7499999999999999E-3,4.8300000000000001E-3,1.9100000000000001E-4,4.4799999999999998E-5,2.3599999999999999E-4,23.3,68.400000000000006,91.7,19.899999999999999,26.1,45.9,0.40500000000000003,0.151,0.55600000000000005]
["R08",2.39,5.79,8.17,1.96E-10,9.4699999999999994E-8,9.4899999999999996E-8,9.1500000000000001E-3,1.35E-2,2.2599999999999999E-2,1.74E-3,1.6999999999999999E-3,3.4399999999999999E-3,8.1400000000000005E-4,2.9299999999999999E-3,3.7499999999999999E-3,1.8699999999999999E-4,6.3999999999999997E-5,2.5099999999999998E-4,21.9,59.4,81.3,16.8,22.4,39.200000000000003,0.253,0.95399999999999996,1.21]
["R09",2.37,5.28,7.65,1.9900000000000001E-10,4.0900000000000002E-8,4.1099999999999997E-8,7.8799999999999999E-3,1.3899999999999999E-2,2.18E-2,1.41E-3,1.98E-3,3.3800000000000002E-3,5.1500000000000005E-4,2.8300000000000001E-3,3.3500000000000001E-3,1.9599999999999999E-4,8.81E-5,2.8400000000000002E-4,21.6,60.2,81.7,13.8,30.6,44.5,6.3100000000000003E-2,0.372,0.435]
["R10",2.39,5.09,7.48,1.96E-10,8.2599999999999998E-8,8.28E-8,9.1500000000000001E-3,1.5299999999999999E-2,2.4500000000000001E-2,1.74E-3,2.3600000000000001E-3,4.1000000000000003E-3,8.1400000000000005E-4,2.8500000000000001E-3,3.6600000000000001E-3,1.8699999999999999E-4,5.0500000000000001E-5,2.3800000000000001E-4,21.9,56.9,78.8,16.8,41.3,58.1,0.253,0.36699999999999999,0.62]
["R11",2.56,5.26,7.82,2.11E-10,1.31E-7,1.31E-7,9.7199999999999995E-3,1.3899999999999999E-2,2.3599999999999999E-2,1.8400000000000001E-3,1.8799999999999999E-3,3.7200000000000002E-3,8.5099999999999998E-4,3.0000000000000001E-3,3.8500000000000001E-3,2.02E-4,6.2299999999999996E-5,2.6400000000000002E-4,23.4,57.4,80.8,17.8,27.4,45.2,0.25700000000000001,0.56999999999999995,0.82699999999999996]
["R12",4.3,4.4400000000000004,8.75,3.6900000000000002E-10,3.3099999999999999E-8,3.3400000000000001E-8,1.21E-2,1.3599999999999999E-2,2.5700000000000001E-2,1.98E-3,1.9400000000000001E-3,3.9199999999999999E-3,4.0000000000000002E-4,3.0899999999999999E-3,3.49E-3,3.7599999999999998E-4,1.7100000000000001E-4,5.4699999999999996E-4,39.1,48.3,87.4,20,23.6,43.6,-0.22900000000000001,0.55500000000000005,0.32600000000000001]
["E01",1.76,5.04,6.79,1.4399999999999999E-10,1.63E-8,1.6400000000000001E-8,6.8700000000000002E-3,1.2800000000000001E-2,1.9699999999999999E-2,1.32E-3,1.5E-3,2.82E-3,6.3500000000000004E-4,2.3E-3,2.9399999999999999E-3,1.37E-4,7.9699999999999999E-5,2.1599999999999999E-4,16.100000000000001,48.8,64.900000000000006,12.7,18.7,31.4,0.20899999999999999,1.1000000000000001,1.31]
["E02",1.76,5.1100000000000003,6.87,1.4499999999999999E-10,7.3399999999999999E-9,7.4799999999999998E-9,6.7400000000000003E-3,1.1900000000000001E-2,1.8599999999999998E-2,1.2800000000000001E-3,1.5100000000000001E-3,2.8E-3,5.9699999999999998E-4,3.2000000000000002E-3,3.8E-3,1.3799999999999999E-4,5.6700000000000003E-5,1.95E-4,16.100000000000001,47.7,63.9,12.4,16.899999999999999,29.2,0.184,1.18,1.37]
["E03",2.19,4.8,6.99,1.81E-10,1.2100000000000001E-8,1.2299999999999999E-8,8.0099999999999998E-3,1.26E-2,2.06E-2,1.5E-3,1.7099999999999999E-3,3.2000000000000002E-3,6.5499999999999998E-4,2.2599999999999999E-3,2.9199999999999999E-3,1.75E-4,6.1600000000000007E-5,2.3599999999999999E-4,20,41.9,61.9,14.5,14.6,29.1,0.17299999999999999,1.32,1.49]
["E04",2.02,5.52,7.54,1.6799999999999999E-10,8.4800000000000005E-9,8.6399999999999999E-9,7.1599999999999997E-3,1.6400000000000001E-2,2.3599999999999999E-2,1.32E-3,2.15E-3,3.47E-3,5.4500000000000002E-4,1.8699999999999999E-3,2.4199999999999998E-3,1.64E-4,7.1699999999999995E-5,2.3599999999999999E-4,18.5,49.5,68,12.8,20.100000000000001,32.9,0.121,1.28,1.4]
["E05",1.23,7.15,8.3800000000000008,1.0700000000000001E-10,1.4699999999999999E-8,1.48E-8,3.1900000000000001E-3,1.5100000000000001E-2,1.83E-2,4.9100000000000001E-4,2.0200000000000001E-3,2.5100000000000001E-3,4.5899999999999998E-5,2.7499999999999998E-3,2.7899999999999999E-3,1.1E-4,1.12E-4,2.22E-4,11.1,64.5,75.7,5.07,23,28.1,-0.109,1.76,1.65]
["E06",2.67,7.33,10,2.16E-10,3.1399999999999999E-9,3.36E-9,1.0999999999999999E-2,1.77E-2,2.87E-2,2.16E-3,2.0799999999999998E-3,4.2399999999999998E-3,1.1100000000000001E-3,1.8400000000000001E-3,2.9499999999999999E-3,2.02E-4,3.9399999999999998E-4,5.9599999999999996E-4,24.5,75,99.5,20.7,26.8,47.4,0.40799999999999997,0.89200000000000002,1.3]
["E07",1.78,3.8,5.58,1.4499999999999999E-10,7.3799999999999999E-8,7.3900000000000007E-8,7.2199999999999999E-3,1.2E-2,1.9199999999999998E-2,1.4E-3,1.7600000000000001E-3,3.16E-3,7.0399999999999998E-4,1.66E-3,2.3600000000000001E-3,1.37E-4,1.1400000000000001E-4,2.5000000000000001E-4,16.399999999999999,47.3,63.7,13.5,28.4,41.9,0.25,0.441,0.69099999999999995]
["E08",2.16,6.85,9.01,1.81E-10,7.9500000000000001E-9,8.1300000000000007E-9,7.1799999999999998E-3,1.66E-2,2.3800000000000002E-2,1.2800000000000001E-3,1.8799999999999999E-3,3.16E-3,4.6900000000000002E-4,5.0600000000000003E-3,5.5300000000000002E-3,1.7899999999999999E-4,1.8100000000000001E-4,3.59E-4,19.7,72,91.6,12.6,25.6,38.200000000000003,5.7500000000000002E-2,1.1000000000000001,1.1599999999999999]
["E09",2.11,5.04,7.15,1.7000000000000001E-10,6.7899999999999999E-9,6.96E-9,8.9700000000000005E-3,1.12E-2,2.0199999999999999E-2,1.7799999999999999E-3,1.4400000000000001E-3,3.2200000000000002E-3,9.3899999999999995E-4,2.3600000000000001E-3,3.3E-3,1.5799999999999999E-4,6.6699999999999995E-5,2.24E-4,19.399999999999999,50.9,70.3,16.899999999999999,17.2,34.200000000000003,0.36399999999999999,0.89500000000000002,1.26]
["E10",1.92,6.26,8.18,1.5899999999999999E-10,1.7199999999999999E-8,1.74E-8,6.8500000000000002E-3,1.38E-2,2.07E-2,1.2700000000000001E-3,1.7700000000000001E-3,3.0400000000000002E-3,5.3200000000000003E-4,1.7899999999999999E-3,2.32E-3,1.55E-4,6.6600000000000006E-5,2.2100000000000001E-4,17.5,58.6,76.099999999999994,12.3,20.8,33.1,0.125,1.48,1.61]
["E11",1.92,6.33,8.24,1.5899999999999999E-10,5.32E-8,5.3400000000000002E-8,6.8500000000000002E-3,1.6799999999999999E-2,2.3699999999999999E-2,1.2700000000000001E-3,1.97E-3,3.2299999999999998E-3,5.3200000000000003E-4,2.1700000000000001E-3,2.7100000000000002E-3,1.55E-4,4.8099999999999997E-5,2.03E-4,17.5,65.900000000000006,83.4,12.3,24.2,36.5,0.125,1.69,1.81]
["K01",2.17,6.14,8.3000000000000007,1.73E-10,5.6299999999999998E-9,5.7999999999999998E-9,9.5999999999999992E-3,1.8800000000000001E-2,2.8400000000000002E-2,1.9300000000000001E-3,2.0400000000000001E-3,3.9699999999999996E-3,1.06E-3,2.8400000000000001E-3,3.8999999999999998E-3,1.5899999999999999E-4,3.4299999999999999E-4,5.0199999999999995E-4,19.899999999999999,61.5,81.400000000000006,18.3,22.7,41.1,0.435,0.72099999999999997,1.1599999999999999]
["K02",1.81,4.24,6.06,1.4000000000000001E-10,7.3E-9,7.44E-9,9.4599999999999997E-3,1.0200000000000001E-2,1.9699999999999999E-2,1.99E-3,1.2999999999999999E-3,3.3E-3,1.24E-3,1.7899999999999999E-3,3.0200000000000001E-3,1.2E-4,7.8499999999999997E-5,1.9900000000000001E-4,16.8,34.799999999999997,51.6,18.7,14.9,33.6,0.58799999999999997,1.4,1.99]
["K03",1.63,6.95,8.57,1.26E-10,8.1199999999999999E-8,8.1299999999999993E-8,8.4499999999999992E-3,2.0199999999999999E-2,2.87E-2,1.7799999999999999E-3,2.1800000000000001E-3,3.9500000000000004E-3,1.1000000000000001E-3,2.8700000000000002E-3,3.9699999999999996E-3,1.08E-4,7.3499999999999998E-5,1.8200000000000001E-4,15.1,73,88,16.7,24.5,41.2,0.52200000000000002,1.1200000000000001,1.64]
["K04",1.51,5.33,6.85,1.19E-10,8.0399999999999995E-9,8.1599999999999999E-9,7.2700000000000004E-3,1.2200000000000001E-2,1.9400000000000001E-2,1.5E-3,1.41E-3,2.9099999999999998E-3,8.7600000000000004E-4,4.0400000000000002E-3,4.9100000000000003E-3,1.06E-4,4.09,4.09,14,52.4,66.3,14.1,17.8,31.9,0.39100000000000001,0.99,1.38]
["K05",1.85,7.31,9.16,1.4399999999999999E-10,1.6700000000000001E-8,1.6800000000000002E-8,9.2399999999999999E-3,2.4400000000000002E-2,3.3599999999999998E-2,1.92E-3,2.8900000000000002E-3,4.8199999999999996E-3,1.16E-3,2.5500000000000002E-3,3.7000000000000002E-3,1.26E-4,2.5999999999999998E-4,3.86E-4,17.100000000000001,77.900000000000006,95,18.100000000000001,29.5,47.6,0.53500000000000003,0.89400000000000002,1.43]
["K06",1.45,5.1100000000000003,6.56,1.09E-10,7.2799999999999997E-9,7.3900000000000003E-9,8.3800000000000003E-3,1.38E-2,2.2100000000000002E-2,1.81E-3,1.49E-3,3.3E-3,1.1900000000000001E-3,2.4299999999999999E-3,3.62E-3,8.9300000000000002E-5,1.25E-4,2.14E-4,13.5,56.8,70.400000000000006,16.899999999999999,20.3,37.200000000000003,0.59799999999999998,0.68100000000000005,1.28]
["K07",1.91,8.32,10.199999999999999,1.51E-10,1.4E-8,1.42E-8,9.0100000000000006E-3,1.78E-2,2.6800000000000001E-2,1.8400000000000001E-3,2.2100000000000002E-3,4.0499999999999998E-3,1.07E-3,1.4500000000000001E-2,1.5599999999999999E-2,1.35E-4,9.5699999999999995E-5,2.31E-4,17.600000000000001,89.1,107,17.399999999999999,29.5,47,0.46899999999999997,1.42,1.89]
["K08",2.36,7.9,10.3,1.79E-10,7.8899999999999998E-9,8.0700000000000005E-9,1.3100000000000001E-2,2.3800000000000002E-2,3.6900000000000002E-2,2.81E-3,3.1099999999999999E-3,5.9199999999999999E-3,1.81E-3,5.9800000000000001E-3,7.7799999999999996E-3,1.4899999999999999E-4,1.54E-4,3.0400000000000002E-4,21.9,90.3,112,26.2,34.799999999999997,61,0.89200000000000002,0.499,1.39]
["K09",1.69,6.04,7.73,1.28E-10,6.2600000000000003E-9,6.3899999999999996E-9,9.6200000000000001E-3,1.6899999999999998E-2,2.6499999999999999E-2,2.0699999999999998E-3,2.3600000000000001E-3,4.4400000000000004E-3,1.3500000000000001E-3,2.3400000000000001E-3,3.6900000000000001E-3,1.06E-4,1.6699999999999999E-4,2.72E-4,15.8,59.8,75.5,19.3,22.5,41.8,0.67200000000000004,1.02,1.69]
["K10",1.89,9.27,11.2,1.43E-10,1.6000000000000001E-8,1.6099999999999999E-8,1.0800000000000001E-2,2.3699999999999999E-2,3.4500000000000003E-2,2.33E-3,3.1199999999999999E-3,5.4400000000000004E-3,1.5200000000000001E-3,5.2500000000000003E-3,6.77E-3,1.18E-4,1.95E-4,3.1300000000000002E-4,17.600000000000001,105,123,21.7,35.200000000000003,56.9,0.75900000000000001,1.0900000000000001,1.85]
["K11",1.21,3.71,4.92,8.2399999999999995E-11,1.1900000000000001E-8,1.2E-8,9.5200000000000007E-3,9.3100000000000006E-3,1.8800000000000001E-2,2.1900000000000001E-3,1.2199999999999999E-3,3.3999999999999998E-3,1.6100000000000001E-3,9.4700000000000003E-4,2.5600000000000002E-3,5.27E-5,3.04E-5,8.3200000000000003E-5,11.5,33.1,44.6,20,12,32,0.89600000000000002,1.02,1.91]
["K12",2.38,5.28,7.66,1.8400000000000001E-10,4.1599999999999997E-9,4.3400000000000003E-9,1.2500000000000001E-2,1.6199999999999999E-2,2.87E-2,2.63E-3,2.48E-3,5.11E-3,1.6299999999999999E-3,1.8E-3,3.4299999999999999E-3,1.5799999999999999E-4,8.7200000000000005E-5,2.4499999999999999E-4,22,53.6,75.599999999999994,24.6,17.399999999999999,42.1,0.77800000000000002,0.74,1.52]
["K13",1.63,4.13,5.77,1.2500000000000001E-10,4.1400000000000002E-9,4.2700000000000004E-9,8.77E-3,1.2E-2,2.0799999999999999E-2,1.8600000000000001E-3,1.49E-3,3.3500000000000001E-3,1.1800000000000001E-3,1.99E-3,3.16E-3,1.06E-4,9.2200000000000005E-5,1.9799999999999999E-4,15.1,39.4,54.5,17.399999999999999,15.7,33.200000000000003,0.56999999999999995,0.66800000000000004,1.24]
["K14",1.61,6.37,7.98,1.2199999999999999E-10,9.0900000000000007E-9,9.2099999999999994E-9,9.1299999999999992E-3,1.34E-2,2.2499999999999999E-2,1.97E-3,1.81E-3,3.7699999999999999E-3,1.2800000000000001E-3,6.4999999999999997E-3,7.7799999999999996E-3,1.01E-4,5.8999999999999998E-5,1.6000000000000001E-4,15,68.8,83.8,18.3,22.7,41.1,0.63600000000000001,0.90900000000000003,1.54]
["K15",2.04,4.8,6.84,1.6100000000000001E-10,8.2100000000000004E-9,8.3699999999999998E-9,9.8700000000000003E-3,1.12E-2,2.1000000000000001E-2,2.0400000000000001E-3,1.4E-3,3.4299999999999999E-3,1.1999999999999999E-3,3.2699999999999999E-3,4.47E-3,1.4200000000000001E-4,7.0900000000000002E-5,2.13E-4,18.8,46.1,64.900000000000006,19.2,15.8,35,0.54,1.04,1.58]
["K16",1.49,5.56,7.05,1.13E-10,7.37E-9,7.4899999999999996E-9,8.3800000000000003E-3,1.5299999999999999E-2,2.3699999999999999E-2,1.8E-3,2.1199999999999999E-3,3.9199999999999999E-3,1.17E-3,3.0500000000000002E-3,4.2199999999999998E-3,9.3599999999999998E-5,8.4400000000000005E-5,1.7799999999999999E-4,13.9,53.4,67.2,16.8,20.100000000000001,36.9,0.57899999999999996,0.874,1.45]
["K17",2.2999999999999998,5.88,8.18,1.71E-10,7.0399999999999997E-9,7.2099999999999997E-9,1.38E-2,1.38E-2,2.76E-2,3.0100000000000001E-3,1.92E-3,4.9399999999999999E-3,2.0100000000000001E-3,5.11E-3,7.1199999999999996E-3,1.37E-4,8.0099999999999995E-5,2.1699999999999999E-4,21.5,63.1,84.5,28,24.5,52.5,1.03,0.85599999999999998,1.89]
["K18",1.1599999999999999,7.88,9.0399999999999991,5.8599999999999997E-11,5.4199999999999999E-9,5.4800000000000001E-9,1.4800000000000001E-2,1.95E-2,3.4299999999999997E-2,3.62E-3,2.3600000000000001E-3,5.9800000000000001E-3,2.9399999999999999E-3,3.1199999999999999E-3,6.0600000000000003E-3,8.4399999999999999E-7,5.8199999999999998E-5,5.91E-5,11.4,70.599999999999994,82,32.700000000000003,26,58.7,1.76,1.77,3.53]
["K19",1.96,5.3,7.26,1.4700000000000001E-10,3.6099999999999999E-8,3.62E-8,1.14E-2,1.32E-2,2.46E-2,2.48E-3,1.8400000000000001E-3,4.3200000000000001E-3,1.64E-3,2.8700000000000002E-3,4.4999999999999997E-3,1.1900000000000001E-4,2.0900000000000001E-4,3.28E-4,18.2,47.5,65.8,23.1,20.100000000000001,43.2,0.82799999999999996,1.34,2.17]
["K20",1.79,6.86,8.65,1.36E-10,1.5700000000000002E-8,1.5799999999999999E-8,1.01E-2,2.0299999999999999E-2,3.0300000000000001E-2,2.16E-3,3.0000000000000001E-3,5.1599999999999997E-3,1.4E-3,2.33E-3,3.7299999999999998E-3,1.13E-4,9.2800000000000006E-5,2.0599999999999999E-4,16.7,72.8,89.5,20.2,24.3,44.5,0.69499999999999995,1.41,2.1]
["K21",2.06,4.76,6.81,1.56E-10,6.5000000000000003E-9,6.65E-9,1.1599999999999999E-2,1.1599999999999999E-2,2.3199999999999998E-2,2.5000000000000001E-3,1.47E-3,3.98E-3,1.6299999999999999E-3,2.0999999999999999E-3,3.7299999999999998E-3,1.2899999999999999E-4,7.9699999999999999E-5,2.0799999999999999E-4,19.100000000000001,42.7,61.8,23.4,14.7,38,0.81,1.2,2.0099999999999998]
["K22",1.66,4.5999999999999996,6.26,1.26E-10,5.5299999999999997E-9,5.6500000000000001E-9,9.3799999999999994E-3,1.24E-2,2.18E-2,2.0200000000000001E-3,1.56E-3,3.5799999999999998E-3,1.31E-3,1.64E-3,2.9499999999999999E-3,1.0399999999999999E-4,1.6200000000000001E-4,2.6600000000000001E-4,15.4,46.7,62.2,18.8,17.2,36,0.65100000000000002,0.8,1.45]
["A05",2.61,5.66,8.27,2.0399999999999999E-10,2.1299999999999999E-8,2.1500000000000001E-8,1.29E-2,1.8800000000000001E-2,3.1800000000000002E-2,2.6900000000000001E-3,2.4599999999999999E-3,5.1500000000000001E-3,1.6100000000000001E-3,2.2000000000000001E-3,3.81E-3,1.7899999999999999E-4,2.5999999999999998E-4,4.4000000000000002E-4,24.1,63.5,87.7,25.3,25.9,51.2,0.73699999999999999,0.35699999999999998,1.0900000000000001]
["A06",2.61,5.48,8.1,2.0399999999999999E-10,2.0400000000000001E-8,2.0599999999999999E-8,1.29E-2,1.83E-2,3.1199999999999999E-2,2.6900000000000001E-3,2.5400000000000002E-3,5.2199999999999998E-3,1.6100000000000001E-3,2.14E-3,3.7499999999999999E-3,1.7899999999999999E-4,2.5999999999999998E-4,4.4000000000000002E-4,24.1,65.599999999999994,89.7,25.3,30.5,55.7,0.73699999999999999,0.26900000000000002,1.01]
["A07",2,7.24,9.25,1.58E-10,1E-8,1.02E-8,9.6699999999999998E-3,2.1700000000000001E-2,3.1399999999999997E-2,1.99E-3,2.3900000000000002E-3,4.3800000000000002E-3,1.17E-3,2.6900000000000001E-3,3.8600000000000001E-3,1.3999999999999999E-4,6.6199999999999996E-5,2.0599999999999999E-4,18.5,69.8,88.3,18.8,27.4,46.2,0.52600000000000002,0.92400000000000004,1.45]
["A08",2.0099999999999998,6.05,8.06,1.57E-10,7.3600000000000002E-9,7.5100000000000007E-9,9.9900000000000006E-3,1.66E-2,2.6599999999999999E-2,2.0799999999999998E-3,2.1900000000000001E-3,4.2599999999999999E-3,1.25E-3,2.1900000000000001E-3,3.4299999999999999E-3,1.3799999999999999E-4,8.8300000000000005E-5,2.2599999999999999E-4,18.600000000000001,58.5,77.099999999999994,19.5,20.399999999999999,39.9,0.57299999999999995,1.1000000000000001,1.67]

{"sheet":"diagram","index":5,"n_rows":43,"n_cols":24,"rows_kept":43,"cut":false,"hidden":true,"merged":[]}
[null,null,null,null,null,null,null,null,null,null,null,null,null,null,null,null,null,null,null,null,{"$f":"_xlfn.XLOOKUP($B$2,B$4:S$4,B5:S5)","v":3.11},{"$f":"A5","v":"minimum"},{"$f":"VLOOKUP(X1,U$1:V$6,2,FALSE)","v":"minimum"},{"$f":"SMALL(U:U,ROW(U1))","v":3.11}]
[null,{"$f":"category&\"\"&aar","v":"GWP80"},null,null,null,null,null,null,null,null,null,null,null,null,null,null,null,null,null,null,5.0774999999999997,"første kvartil",{"$f":"VLOOKUP(X2,U$1:V$6,2,FALSE)","v":"min bygning"},{"$f":"SMALL(U:U,ROW(U2))","v":4.4437447464635573}]
[null,null,null,null,null,null,null,null,null,null,null,null,null,null,null,null,null,null,null,null,5.7249999999999996,"median",{"$f":"VLOOKUP(X3,U$1:V$6,2,FALSE)","v":"første kvartil"},{"$f":"SMALL(U:U,ROW(U3))","v":5.0774999999999997}]
["navn","GWP50","GWP80","ODP50","ODP80","AP50","AP80","EP50","EP80","POCP50","POCP80","ADPf50","ADPf80","ADPe50","ADPe80","PEtot50","PEtot80","Sek50","Sek80",null,6.7824999999999998,"tredje kvartil",{"$f":"VLOOKUP(X4,U$1:V$6,2,FALSE)","v":"median"},{"$f":"SMALL(U:U,ROW(U4))","v":5.7249999999999996}]
["minimum",{"$f":"QUARTILE(INDIRECT(\"db_\"&B$4),0)","v":3.67},{"$f":"QUARTILE(INDIRECT(\"db_\"&C$4),0)","v":3.11},4.9200000000000004E-9,3.1399999999999999E-9,1.1299999999999999E-2,9.1800000000000007E-3,1.67E-3,1.2199999999999999E-3,8.8900000000000003E-4,9.4700000000000003E-4,41.5,33.1,3.6699999999999998E-5,3.04E-5,16.399999999999999,12,0.182,0.121,null,9.5,"maksimum",{"$f":"VLOOKUP(X5,U$1:V$6,2,FALSE)","v":"tredje kvartil"},{"$f":"SMALL(U:U,ROW(U5))","v":6.7824999999999998}]
["første kvartil",{"$f":"QUARTILE(INDIRECT(\"db_\"&B$4),1)","v":6.3049999999999997},{"$f":"QUARTILE(INDIRECT(\"db_\"&C$4),1)","v":5.0774999999999997},1.0474999999999999E-8,7.3674999999999996E-9,1.5775000000000001E-2,1.2775E-2,2.1450000000000002E-3,1.7174999999999998E-3,2.8024999999999999E-3,2.1975000000000002E-3,61.2,50.174999999999997,7.1750000000000009E-5,6.3349999999999995E-5,23.8,20.100000000000001,0.77925,0.49399999999999999,null,4.4437447464635573,"min bygning",{"$f":"IF(ISERROR(VLOOKUP(X6,U$1:V$6,2,FALSE)),\"-\",VLOOKUP(X6,U$1:V$6,2,FALSE))","v":"maksimum"},{"$f":"IF(ISERROR(SMALL(U:U,ROW(U6))),0,SMALL(U:U,ROW(U6)))","v":9.5}]
["median",{"$f":"QUARTILE(INDIRECT(\"db_\"&B$4),2)","v":7.0749999999999993},{"$f":"QUARTILE(INDIRECT(\"db_\"&C$4),2)","v":5.7249999999999996},2E-8,1.55E-8,1.7849999999999998E-2,1.52E-2,2.4099999999999998E-3,1.9750000000000002E-3,3.6099999999999999E-3,2.8600000000000001E-3,71.949999999999989,61.3,1.0449999999999999E-4,8.5799999999999998E-5,29.7,24.5,1.32,0.84699999999999998]
["tredje kvartil",{"$f":"QUARTILE(INDIRECT(\"db_\"&B$4),3)","v":8.5224999999999991},{"$f":"QUARTILE(INDIRECT(\"db_\"&C$4),3)","v":6.7824999999999998},4.88E-8,4.1575E-8,2.2100000000000002E-2,1.8974999999999999E-2,2.8425E-3,2.3675000000000002E-3,5.13E-3,3.7000000000000002E-3,86.024999999999991,71.775000000000006,1.8525E-4,1.6799999999999999E-4,35.524999999999999,29.200000000000003,1.7324999999999999,1.1000000000000001]
["maksimum",{"$f":"QUARTILE(INDIRECT(\"db_\"&B$4),4)","v":10.8},{"$f":"QUARTILE(INDIRECT(\"db_\"&C$4),4)","v":9.5},1.85E-7,1.99E-7,3.1300000000000001E-2,2.47E-2,3.6600000000000001E-3,3.1199999999999999E-3,1.4200000000000001E-2,1.4500000000000001E-2,119,111,3.27,4.09,47.8,43.5,2.82,1.77]
[{"$f":"_xlfn.SINGLE(v_navn)","v":"min bygning"},{"$f":"forside!$C$29","v":4.4437447464635573},{"$f":"forside!$C$29","v":4.4437447464635573},{"$f":"forside!$C$29","v":4.4437447464635573},{"$f":"forside!$C$29","v":4.4437447464635573},{"$f":"forside!$C$29","v":4.4437447464635573},{"$f":"forside!$C$29","v":4.4437447464635573},{"$f":"forside!$C$29","v":4.4437447464635573},{"$f":"forside!$C$29","v":4.4437447464635573},{"$f":"forside!$C$29","v":4.4437447464635573},{"$f":"forside!$C$29","v":4.4437447464635573},{"$f":"forside!$C$29","v":4.4437447464635573},{"$f":"forside!$C$29","v":4.4437447464635573},{"$f":"forside!$C$29","v":4.4437447464635573},{"$f":"forside!$C$29","v":4.4437447464635573},{"$f":"forside!$C$29","v":4.4437447464635573},{"$f":"forside!$C$29","v":4.4437447464635573},{"$f":"forside!$C$29","v":4.4437447464635573},{"$f":"forside!$C$29","v":4.4437447464635573}]
[]
[]
[]
[{"$f":"W1","v":"minimum"},3.11]
["min bygning",4.4437447464635573]
["første kvartil",5.0774999999999997]
["median",5.7249999999999996]
["tredje kvartil",6.7824999999999998]
["maksimum",9.5]
[]
[]
[]
["matches"]
[{"$f":"\"01. \"&beregning!C7","v":"01. E07"},{"$f":"_xlfn.XLOOKUP(category,beregning!$L$7:$L$15,beregning!M$7:M$15)","v":3.8}]
[{"$f":"\"02. \"& beregning!E7","v":"02. Enf03"},{"$f":"_xlfn.XLOOKUP(category,beregning!$L$7:$L$15,beregning!O$7:O$15)","v":4.5599999999999996}]
[{"$f":"\"03. \"&beregning!G7","v":"03. R09"},{"$f":"_xlfn.XLOOKUP(category,beregning!$L$7:$L$15,beregning!Q$7:Q$15)","v":5.28}]
[{"$f":"A10","v":"min bygning"},{"$f":"forside!$C$29","v":4.4437447464635573}]
[]
[]
[]
[]
["andel bygningsdele"]
["fundament",{"$f":"B$27*C33","v":0.36424137266094736},{"$f":"'andel bygningsdele'!F5","v":8.1967213114754106E-2}]
["terrændæk",{"$f":"B$27*C34","v":0.36424137266094736},{"$f":"'andel bygningsdele'!F6","v":8.1967213114754106E-2}]
["dæk",1.0198758434506525,{"$f":"'andel bygningsdele'!F7","v":0.22950819672131148}]
["ydervægge",0.50993792172532626,{"$f":"'andel bygningsdele'!F8","v":0.11475409836065574}]
["vinduer",0.72848274532189472,{"$f":"'andel bygningsdele'!F9","v":0.16393442622950821}]
["facadebeklædning",0.36424137266094736,{"$f":"'andel bygningsdele'!F10","v":8.1967213114754106E-2}]
["indervægge",0.21854482359656838,{"$f":"'andel bygningsdele'!F11","v":4.9180327868852458E-2}]
["tage",0.29139309812875785,{"$f":"'andel bygningsdele'!F12","v":6.5573770491803282E-2}]
["tagbeklædning",0.58278619625751571,{"$f":"'andel bygningsdele'!F13","v":0.13114754098360656}]
[]
[null,null,{"$f":"SUM(C33:C41)","v":1}]

{"sheet":"menuer","index":6,"n_rows":27,"n_cols":13,"rows_kept":27,"cut":false,"hidden":true,"merged":[]}
["menuer",1]
[]
[]
[]
["vælg tilstand",null,"vælg materialet",null,"GWP",null,null,null,null,"GWP","CO2eq ","kg","tons"]
["god",null,"beton/cement",null,"GWP samlet [tons]",null,50,null,null,"ODP","R11eq ","kg","tons"]
["middel",null,"træ",null,"GWP / m2 [kg]",null,80,null,null,"AP","SO2eq","kg","tons"]
["under middel",null,"metal",null,null,null,null,null,null,"EP","PO4eq","kg","tons"]
["dårlig",null,"tegl",null,null,null,null,null,null,"POCP","ethen.eq","kg","tons"]
["ingen data",null,"tagpap",null,null,null,null,null,null,"ADPf",null,"MJ","GJ"]
[null,null,"natursten",null,null,null,null,null,null,"ADPe","Sb.eq","kg","tons"]
[null,null,"fibercement",null,null,null,null,null,null,"PEtot",null,"kWh","MWh"]
[null,null,"glas",null,null,null,null,null,null,"Sek",null,"kWh","MWh"]
[]
[]
[]
[]
[]
[]
[]
[]
[]
[]
[]
[]
[null,null,"renoverings GWP antaget"]
[null,null,2.4]

{"sheet":"beregning","index":7,"n_rows":15,"n_cols":29,"rows_kept":15,"cut":false,"hidden":true,"merged":[]}
[]
[]
[null,null,null,null,null,null,null,null,null,null,null,null,null,null,null,null,null,null,null,null,null,null,null,null,null,"bedst match"]
[null,null,null,null,null,null,null,null,null,null,null,null,null,null,null,null,null,null,null,null,null,null,null,null,null,{"$f":"C7","v":"E07"}]
[null,null,null,null,null,null,null,null,null,null,null,null,null,null,null,null,null,null,null,null,"resultat","tons","tons","tons",null,"resultat","tons","tons","tons"]
[null,null,"match 1","match 1 - score","match 2","match 2 - score","match 3","match 3 - score",null,"varians",null,null,1,"faktor",2,"faktor",3,"faktor",null,null,"/m2 a",{"$f":"\"/m2/\"&aar&\" år\"","v":"/m2/80 år"},"per år","total",null,"/m2 a",{"$f":"\"/m2/\"&aar&\" år\"","v":"/m2/80 år"},"per år","total"]
[null,null,"E07",100.09999847412109,"Enf03",70.900001525878906,"R09",67.199996948242188,"alle",{"$f":"SQRT((300-(D8+F8+H8))/300)","v":0.45423929642821126},{"$f":"_xlfn.VAR.S(M7,O7,Q7)","v":0.5477333333333263},{"$f":"T7","v":"GWP"},{"$f":"_xlfn.XLOOKUP(C$7,db_names,INDIRECT(\"db_\"&$L7&\"\"&aar),\"\")","v":3.8},{"$f":"M7*($D$7)","v":380.37999420166011},{"$f":"_xlfn.XLOOKUP(E$7,db_names,INDIRECT(\"db_\"&$L7&\"\"&aar),\"\")","v":4.5599999999999996},{"$f":"O7*($F$7)","v":323.30400695800779},{"$f":"_xlfn.XLOOKUP(G$7,db_names,INDIRECT(\"db_\"&$L7&\"\"&aar),\"\")","v":5.28},{"$f":"Q7*$H$7","v":354.81598388671875},null,{"$f":"menuer!J5","v":"GWP"},{"$f":"IF(M7>0,IF(ISERROR((N7+P7+R7)/(D$7+F$7+H$7)),\"-\",(N7+P7+R7)/(D$7+F$7+H$7)),0)","v":4.4437447464635573},{"$f":"IF(ISERROR(U7*aar/1000),\"-\",U7*aar/1000)","v":0.35549957971708462},{"$f":"IF(ISERROR(U7*areal/1000),\"-\",U7*areal/1000)","v":13.331234239390673},{"$f":"IF(ISERROR(U7*aar*areal/1000),\"-\",U7*aar*areal/1000)","v":1066.4987391512539},null,{"$f":"IF(ISERROR(M7),\"-\",M7)","v":3.8},{"$f":"IF(ISERROR(Z7*aar/1000),\"-\",Z7*aar/1000)","v":0.30399999999999999},{"$f":"IF(ISERROR(Z7*areal/1000),\"-\",Z7*areal/1000)","v":11.4},{"$f":"IF(ISERROR(Z7*aar*areal/1000),\"-\",Z7*aar*areal/1000)","v":912}]
[null,null,null,{"$f":"IF(D7>100,100,D7)","v":100},null,{"$f":"IF(F7>100,100,F7)","v":70.900001525878906},null,{"$f":"IF(H7>100,100,H7)","v":67.199996948242188},{"$f":"C7","v":"E07"},{"$f":"1-D8/100","v":0},null,"ODP",{"$f":"_xlfn.XLOOKUP(C$7,db_names,INDIRECT(\"db_\"&L8&\"\"&aar),\"\")","v":7.3799999999999999E-8},7.3873798873901368E-6,{"$f":"_xlfn.XLOOKUP(E$7,db_names,INDIRECT(\"db_\"&$L8&\"\"&aar),\"\")","v":7.6500000000000003E-8},5.4238501167297364E-6,{"$f":"_xlfn.XLOOKUP(G$7,db_names,INDIRECT(\"db_\"&$L8&\"\"&aar),\"\")","v":4.0900000000000002E-8},2.7484798751831056E-6,null,{"$f":"menuer!J6","v":"ODP"},{"$f":"IF(M8>0,IF(ISERROR((N8+P8+R8)/(D$7+F$7+H$7)),\"-\",(N8+P8+R8)/(D$7+F$7+H$7)),0)","v":6.5322040632451835E-8},5.2257632505961463E-9,1.959661218973555E-7,1.5677289751788439E-5,null,{"$f":"IF(ISERROR(M8),\"-\",M8)","v":7.3799999999999999E-8},5.9039999999999995E-9,2.2139999999999998E-7,1.7711999999999999E-5]
[null,null,null,null,null,null,null,null,null,null,null,"AP",{"$f":"_xlfn.XLOOKUP(C$7,db_names,INDIRECT(\"db_\"&L9&\"\"&aar),\"\")","v":1.2E-2},1.2011999816894532,{"$f":"_xlfn.XLOOKUP(E$7,db_names,INDIRECT(\"db_\"&$L9&\"\"&aar),\"\")","v":1.95E-2},1.3825500297546387,{"$f":"_xlfn.XLOOKUP(G$7,db_names,INDIRECT(\"db_\"&$L9&\"\"&aar),\"\")","v":1.3899999999999999E-2},0.93407995758056639,null,{"$f":"menuer!J7","v":"AP"},1.4768387968489513E-2,1.181471037479161E-3,4.4305163905468542E-2,3.5444131124374829,null,1.2E-2,9.5999999999999992E-4,3.5999999999999997E-2,2.88]
[null,null,null,null,null,null,null,null,null,null,null,"EP",{"$f":"_xlfn.XLOOKUP(C$7,db_names,INDIRECT(\"db_\"&L10&\"\"&aar),\"\")","v":1.7600000000000001E-3},0.17617599731445313,{"$f":"_xlfn.XLOOKUP(E$7,db_names,INDIRECT(\"db_\"&$L10&\"\"&aar),\"\")","v":2.8400000000000001E-3},0.2013560043334961,{"$f":"_xlfn.XLOOKUP(G$7,db_names,INDIRECT(\"db_\"&$L10&\"\"&aar),\"\")","v":1.98E-3},0.13305599395751952,null,{"$f":"menuer!J8","v":"EP"},2.1435264573761224E-3,1.7148211659008981E-4,6.4305793721283668E-3,0.51444634977026937,null,1.7600000000000001E-3,1.4080000000000001E-4,5.28E-3,0.42240000000000005]
[null,null,null,null,null,null,null,null,null,null,null,"POCP",{"$f":"_xlfn.XLOOKUP(C$7,db_names,INDIRECT(\"db_\"&L11&\"\"&aar),\"\")","v":1.66E-3},0.16616599746704103,{"$f":"_xlfn.XLOOKUP(E$7,db_names,INDIRECT(\"db_\"&$L11&\"\"&aar),\"\")","v":9.59E-4},6.799310146331787E-2,{"$f":"_xlfn.XLOOKUP(G$7,db_names,INDIRECT(\"db_\"&$L11&\"\"&aar),\"\")","v":2.8300000000000001E-3},0.19017599136352539,null,{"$f":"menuer!J9","v":"POCP"},1.7814235756941964E-3,1.4251388605553573E-4,5.3442707270825894E-3,0.42754165816660711,null,1.66E-3,1.328E-4,4.9800000000000001E-3,0.39839999999999998]
[null,null,null,null,null,null,null,null,null,null,null,"ADPf",{"$f":"_xlfn.XLOOKUP(C$7,db_names,INDIRECT(\"db_\"&L12&\"\"&aar),\"\")","v":47.3},4734.729927825927,{"$f":"_xlfn.XLOOKUP(E$7,db_names,INDIRECT(\"db_\"&$L12&\"\"&aar),\"\")","v":56.3},3991.6700859069824,{"$f":"_xlfn.XLOOKUP(G$7,db_names,INDIRECT(\"db_\"&$L12&\"\"&aar),\"\")","v":60.2},4045.4398162841799,null,{"$f":"menuer!J10","v":"ADPf"},53.618135993478816,4.2894508794783048,160.85440798043646,12868.352638434915,null,47.3,3.7839999999999998,141.9,11352]
[null,null,null,null,null,null,null,null,null,null,null,"ADPe",{"$f":"_xlfn.XLOOKUP(C$7,db_names,INDIRECT(\"db_\"&L13&\"\"&aar),\"\")","v":1.1400000000000001E-4},1.1411399826049806E-2,{"$f":"_xlfn.XLOOKUP(E$7,db_names,INDIRECT(\"db_\"&$L13&\"\"&aar),\"\")","v":2.02E-4},1.432180030822754E-2,{"$f":"_xlfn.XLOOKUP(G$7,db_names,INDIRECT(\"db_\"&$L13&\"\"&aar),\"\")","v":8.81E-5},5.9203197311401366E-3,null,{"$f":"menuer!J11","v":"ADPe"},1.3288631515933808E-4,1.0630905212747047E-5,3.9865894547801422E-4,3.1892715638241143E-2,null,1.1400000000000001E-4,9.1199999999999991E-6,3.4200000000000002E-4,2.7359999999999999E-2]
[null,null,null,null,null,null,null,null,null,null,null,"PEtot",{"$f":"_xlfn.XLOOKUP(C$7,db_names,INDIRECT(\"db_\"&L14&\"\"&aar),\"\")","v":28.4},2842.8399566650387,{"$f":"_xlfn.XLOOKUP(E$7,db_names,INDIRECT(\"db_\"&$L14&\"\"&aar),\"\")","v":29.9},2119.9100456237793,{"$f":"_xlfn.XLOOKUP(G$7,db_names,INDIRECT(\"db_\"&$L14&\"\"&aar),\"\")","v":30.6},2056.319906616211,null,{"$f":"menuer!J12","v":"PEtot"},29.467128458570816,2.3573702766856655,88.401385375712451,7072.1108300569958,null,28.4,2.2719999999999998,85.2,6816]
[null,null,null,null,null,null,null,null,null,null,null,"Sek",{"$f":"_xlfn.XLOOKUP(C$7,db_names,INDIRECT(\"db_\"&L15&\"\"&aar),\"\")","v":0.441},44.144099327087403,{"$f":"_xlfn.XLOOKUP(E$7,db_names,INDIRECT(\"db_\"&$L15&\"\"&aar),\"\")","v":0.121},8.5789001846313475,{"$f":"_xlfn.XLOOKUP(G$7,db_names,INDIRECT(\"db_\"&$L15&\"\"&aar),\"\")","v":0.372},24.998398864746093,null,{"$f":"menuer!J13","v":"Sek"},0.32628631138627895,2.6102904910902319E-2,0.97885893415883685,78.30871473270696,null,0.441,3.5279999999999999E-2,1.323,105.84]

{"sheet":"andel bygningsdele","index":8,"n_rows":15,"n_cols":7,"rows_kept":15,"cut":false,"hidden":true,"merged":[]}
[]
[]
[]
[]
[null,null,null,"fundament",0.5,{"$f":"E5/E$15","v":8.1967213114754106E-2},{"$f":"ROUND(F5*100,0)","v":8}]
[null,null,null,"terrændæk",0.5,8.1967213114754106E-2,{"$f":"ROUND(F6*100,0)","v":8}]
[null,null,null,"dæk",1.4,0.22950819672131148,23]
[null,null,null,"ydervægge",0.7,0.11475409836065574,11]
[null,null,null,"vinduer",1,0.16393442622950821,16]
[null,null,null,"facadebeklædning",0.5,8.1967213114754106E-2,8]
[null,null,null,"indervægge",0.3,4.9180327868852458E-2,5]
[null,null,null,"tage",0.4,6.5573770491803282E-2,7]
[null,null,null,"tagbeklædning",0.8,0.13114754098360656,13]
[]
[null,null,null,null,{"$f":"SUM(E5:E13)","v":6.1},{"$f":"SUM(F5:F13)","v":1}]