{"text_format":"1","workbook":"xlsx","n_sheets":9,"sheets":["forside","license","db_LCA","db_LCA50","db_LCA80","diagram","menuer","beregning","andel bygningsdele"],"not_rendered":{"charts":4,"images":0,"macros":1,"external_links":0,"defined_names":30,"comments":0,"pivot_tables":0},"unopened":[],"bounds":{"document_bytes":16777216,"sheet_cells":100000,"rows_first":2000,"rows_last":500,"rows_between":2000,"halvings":0,"cell_chars":16384,"cell_head_chars":4096},"cells_cut":0,"cells_raw":0,"read":"whole","date_system":"1900"}

{"sheet":"forside","index":0,"n_rows":51,"n_cols":8,"rows_kept":51,"cut":false,"hidden":false,"merged":[[8,4,8,5],[9,4,9,5],[46,1,46,2]]}
[]
[]
[]
[null,"LCAestimator"]
[null,"vandkunsten 2020"]
[]
[]
[]
{"$rows_left_out":44}
{"sheet":"license","index":1,"n_rows":25,"n_cols":2,"rows_kept":25,"cut":false,"hidden":false,"merged":[]}
[]
[]
[]
[]
[null,"Begin license text."]
[]
[]
[null,"Copyright 2021 / vandkunsten architects (Jan S. Kauschen)"]
{"$rows_left_out":18}
{"sheet":"db_LCA","index":2,"n_rows":65,"n_cols":50,"rows_kept":65,"cut":false,"hidden":true,"merged":[[1,21,1,22],[2,21,2,22],[3,21,3,22],[2,24,2,25],[2,27,2,28],[2,45,2,46],[2,30,2,31],[2,33,2,34],[2,36,2,37],[2,39,2,40],[2,42,2,43]]}
[1,2,3,4,5,6,7,8,9,10,11,12,13,14,15,16,17,18,19,20,21,22,23,null,24,25,null,26,27,null,28,29,null,30,31,null,32,33,null,34,35,null,36,37,null,38,39,40,41,42]
[null,null,null,null,"type",null,null,null,null,null,null,null,null,null,null,null,null,null,null,null,null,"GWP",null,null,"ODP",null,null,"AP",null,null,"EP",null,null,"POCP",null,null,"ADPe",null,null,"ADPf",null,null,"Petot",null,null,"Sek"]
[null,null,null,null,null,null,null,null,null,null,null,null,null,null,null,null,null,null,null,null,null,"A1-3, B4, C3-4",null,null,"A1-3, B4, C3-4",null,null,"A1-3, B4, C3-4",null,null,"A1-3, B4, C3-4",null,null,"A1-3, B4, C3-4",null,null,"A1-3, B4, C3-4",null,null,"A1-3, B4, C3-4",null,null,"A1-3, B4, C3-4",null,null,"A1-3, B4, C3-4"]
[null,null,null,null,null,null,null,null,null,null,null,null,null,null,null,null,null,null,null,null,null,"kg CO2eq/m2",null,null,"kg R11eq/m2",null,null,"kg SO2eq/m2",null,null,"kg PO4eq/m2",null,null,"kg ethen eq/m2",null,null,"kg Sb eq/m2",null,null,"MJ/m2",null,null,"kWh/m2",null,null,"kWh/m2"]
[null,null,null,"størrelse","fundament","terrændæk","terrændæk","dæk","dæk","ydervægge, bærende konstruktion","ydervægge, bærende konstruktion","ydervægge, overflade","ydervægge, overflade","indervægge","indervægge","vinduer","vinduer","tag, bærende konstruktion","tag, bærende konstruktion","tag, overfalde","tag, overfalde","50 år","80år",null,"50 år","80år",null,"50 år","80år",null,"50 år","80år",null,"50 år","80år",null,"50 år","80år",null,"50 år","80år",null,"50 år","80år",null,"50 år","80år"]
["A05",null,null,"stor","beton/cement","beton/cement",null,"beton/cement",null,"beton/cement",null,"metal",null,"beton/cement",null,"metal",null,"beton/cement",null,"tagpap",null,{"$f":"_xlfn.XLOOKUP($A6,db_LCA50!$A:$A,db_LCA50!C:C)","v":6.62},{"$f":"_xlfn.XLOOKUP($A6,db_LCA80!$A:$A,db_LCA80!C:C)","v":5.66},null,{"$f":"_xlfn.XLOOKUP($A6,db_LCA50!$A:$A,db_LCA50!F:F)","v":2.6400000000000001E-8},{"$f":"_xlfn.XLOOKUP($A6,db_LCA80!$A:$A,db_LCA80!F:F)","v":2.1299999999999999E-8},null,{"$f":"_xlfn.XLOOKUP($A6,db_LCA50!$A:$A,db_LCA50!I:I)","v":2.1399999999999999E-2},{"$f":"_xlfn.XLOOKUP($A6,db_LCA80!$A:$A,db_LCA80!I:I)","v":1.8800000000000001E-2},null,{"$f":"_xlfn.XLOOKUP($A6,db_LCA50!$A:$A,db_LCA50!L:L)","v":2.8500000000000001E-3},{"$f":"_xlfn.XLOOKUP($A6,db_LCA80!$A:$A,db_LCA80!L:L)","v":2.4599999999999999E-3},null,{"$f":"_xlfn.XLOOKUP($A6,db_LCA50!$A:$A,db_LCA50!O:O)","v":2.5500000000000002E-3},{"$f":"_xlfn.XLOOKUP($A6,db_LCA80!$A:$A,db_LCA80!O:O)","v":2.2000000000000001E-3},null,{"$f":"_xlfn.XLOOKUP($A6,db_LCA50!$A:$A,db_LCA50!R:R)","v":2.81E-4},{"$f":"_xlfn.XLOOKUP($A6,db_LCA80!$A:$A,db_LCA80!R:R)","v":2.5999999999999998E-4},null,{"$f":"_xlfn.XLOOKUP($A6,db_LCA50!$A:$A,db_LCA50!U:U)","v":71.8},{"$f":"_xlfn.XLOOKUP($A6,db_LCA80!$A:$A,db_LCA80!U:U)","v":63.5},null,{"$f":"_xlfn.XLOOKUP($A6,db_LCA50!$A:$A,db_LCA50!X:X)","v":30},{"$f":"_xlfn.XLOOKUP($A6,db_LCA80!$A:$A,db_LCA80!X:X)","v":25.9},null,{"$f":"_xlfn.XLOOKUP($A6,db_LCA50!$A:$A,db_LCA50!AA:AA)","v":0.56899999999999995},{"$f":"_xlfn.XLOOKUP($A6,db_LCA80!$A:$A,db_LCA80!AA:AA)","v":0.35699999999999998}]
["A06",null,null,"stor","beton/cement","beton/cement",null,"beton/cement",null,"metal",null,"metal",null,"beton/cement",null,"metal",null,"beton/cement",null,"tagpap",null,{"$f":"_xlfn.XLOOKUP(A7,db_LCA50!A:A,db_LCA50!C:C)","v":6.25},{"$f":"_xlfn.XLOOKUP($A7,db_LCA80!$A:$A,db_LCA80!C:C)","v":5.48},null,{"$f":"_xlfn.XLOOKUP($A7,db_LCA50!$A:$A,db_LCA50!F:F)","v":2.66E-8},{"$f":"_xlfn.XLOOKUP($A7,db_LCA80!$A:$A,db_LCA80!F:F)","v":2.0400000000000001E-8},null,{"$f":"_xlfn.XLOOKUP($A7,db_LCA50!$A:$A,db_LCA50!I:I)","v":2.0400000000000001E-2},{"$f":"_xlfn.XLOOKUP($A7,db_LCA80!$A:$A,db_LCA80!I:I)","v":1.83E-2},null,{"$f":"_xlfn.XLOOKUP($A7,db_LCA50!$A:$A,db_LCA50!L:L)","v":2.8800000000000002E-3},{"$f":"_xlfn.XLOOKUP($A7,db_LCA80!$A:$A,db_LCA80!L:L)","v":2.5400000000000002E-3},null,{"$f":"_xlfn.XLOOKUP($A7,db_LCA50!$A:$A,db_LCA50!O:O)","v":2.4399999999999999E-3},{"$f":"_xlfn.XLOOKUP($A7,db_LCA80!$A:$A,db_LCA80!O:O)","v":2.14E-3},null,{"$f":"_xlfn.XLOOKUP($A7,db_LCA50!$A:$A,db_LCA50!R:R)","v":2.81E-4},{"$f":"_xlfn.XLOOKUP($A7,db_LCA80!$A:$A,db_LCA80!R:R)","v":2.5999999999999998E-4},null,{"$f":"_xlfn.XLOOKUP($A7,db_LCA50!$A:$A,db_LCA50!U:U)","v":71.7},{"$f":"_xlfn.XLOOKUP($A7,db_LCA80!$A:$A,db_LCA80!U:U)","v":65.599999999999994},null,{"$f":"_xlfn.XLOOKUP($A7,db_LCA50!$A:$A,db_LCA50!X:X)","v":33.200000000000003},{"$f":"_xlfn.XLOOKUP($A7,db_LCA80!$A:$A,db_LCA80!X:X)","v":30.5},null,{"$f":"_xlfn.XLOOKUP($A7,db_LCA50!$A:$A,db_LCA50!AA:AA)","v":0.42899999999999999},{"$f":"_xlfn.XLOOKUP($A7,db_LCA80!$A:$A,db_LCA80!AA:AA)","v":0.26900000000000002}]
["A07",null,null,"mellem","beton/cement","beton/cement",null,"beton/cement",null,"beton/cement",null,"metal",null,"beton/cement",null,"træ","metal","beton/cement",null,"tagpap",null,{"$f":"_xlfn.XLOOKUP(A8,db_LCA50!A:A,db_LCA50!C:C)","v":10.1},{"$f":"_xlfn.XLOOKUP($A8,db_LCA80!$A:$A,db_LCA80!C:C)","v":7.24},null,{"$f":"_xlfn.XLOOKUP($A8,db_LCA50!$A:$A,db_LCA50!F:F)","v":1.3399999999999999E-8},{"$f":"_xlfn.XLOOKUP($A8,db_LCA80!$A:$A,db_LCA80!F:F)","v":1E-8},null,{"$f":"_xlfn.XLOOKUP($A8,db_LCA50!$A:$A,db_LCA50!I:I)","v":2.9700000000000001E-2},{"$f":"_xlfn.XLOOKUP($A8,db_LCA80!$A:$A,db_LCA80!I:I)","v":2.1700000000000001E-2},null,{"$f":"_xlfn.XLOOKUP($A8,db_LCA50!$A:$A,db_LCA50!L:L)","v":3.0599999999999998E-3},{"$f":"_xlfn.XLOOKUP($A8,db_LCA80!$A:$A,db_LCA80!L:L)","v":2.3900000000000002E-3},null,{"$f":"_xlfn.XLOOKUP($A8,db_LCA50!$A:$A,db_LCA50!O:O)","v":3.79E-3},{"$f":"_xlfn.XLOOKUP($A8,db_LCA80!$A:$A,db_LCA80!O:O)","v":2.6900000000000001E-3},null,{"$f":"_xlfn.XLOOKUP($A8,db_LCA50!$A:$A,db_LCA50!R:R)","v":7.2000000000000002E-5},{"$f":"_xlfn.XLOOKUP($A8,db_LCA80!$A:$A,db_LCA80!R:R)","v":6.6199999999999996E-5},null,{"$f":"_xlfn.XLOOKUP($A8,db_LCA50!$A:$A,db_LCA50!U:U)","v":94.8},{"$f":"_xlfn.XLOOKUP($A8,db_LCA80!$A:$A,db_LCA80!U:U)","v":69.8},null,{"$f":"_xlfn.XLOOKUP($A8,db_LCA50!$A:$A,db_LCA50!X:X)","v":37.200000000000003},{"$f":"_xlfn.XLOOKUP($A8,db_LCA80!$A:$A,db_LCA80!X:X)","v":27.4},null,{"$f":"_xlfn.XLOOKUP($A8,db_LCA50!$A:$A,db_LCA50!AA:AA)","v":1.47},{"$f":"_xlfn.XLOOKUP($A8,db_LCA80!$A:$A,db_LCA80!AA:AA)","v":0.92400000000000004}]
{"$rows_left_out":58}
{"sheet":"db_LCA50","index":3,"n_rows":62,"n_cols":28,"rows_kept":62,"cut":false,"hidden":true,"merged":[]}
["50år","GWP","kg CO2eq/m2/år",null,"ODP","kg R11-ækv/m2/år",null,"AP","kg SO2--ækv/m2/år",null,"EP","kg PO4--ækv/m2/år",null,"POCP","kg ethen--ækv/m2/år",null,"ADPe","kg Sb--ækv/m2/år",null,"ADPf","MJ/m2/år",null,"Petot","kWh/m2/år",null,"Sek","kWh/m2/år"]
[null,"Drift B6","Materialer A1-3, B4, C3-4","Alle faser\nA1-3, B4, B6, C3-4","Drift B6","Materialer A1-3, B4, C3-4","Alle faser\nA1-3, B4, B6, C3-4","Drift B6","Materialer A1-3, B4, C3-4","Alle faser\nA1-3, B4, B6, C3-4","Drift B6","Materialer A1-3, B4, C3-4","Alle faser\nA1-3, B4, B6, C3-4","Drift B6","Materialer A1-3, B4, C3-4","Alle faser\nA1-3, B4, B6, C3-4","Drift B6","Materialer A1-3, B4, C3-4","Alle faser\nA1-3, B4, B6, C3-4","Drift B6","Materialer A1-3, B4, C3-4","Alle faser\nA1-3, B4, B6, C3-4","Drift B6","Materialer A1-3, B4, C3-4","Alle faser\nA1-3, B4, B6, C3-4","Drift B6","Materialer A1-3, B4, C3-4","Alle faser\nA1-3, B4, B6, C3-4"]
["Enf01",3.08,6.16,9.24,2.4199999999999999E-10,3.8199999999999998E-8,3.8500000000000001E-8,1.34E-2,1.83E-2,3.1699999999999999E-2,2.6099999999999999E-3,2.16E-3,4.7600000000000003E-3,1.4E-3,3.2399999999999998E-3,4.64E-3,2.2499999999999999E-4,6.7899999999999997E-5,2.9300000000000002E-4,28.7,59.6,88.3,23.6,24.7,48.4,0.42,0.78100000000000003,1.2]
["Enf02",2.66,7.1,9.76,2.1199999999999999E-10,5.1599999999999999E-8,5.1900000000000002E-8,1.0999999999999999E-2,1.7399999999999999E-2,2.8400000000000002E-2,2.0799999999999998E-3,2.3500000000000001E-3,4.4200000000000003E-3,1.0399999999999999E-3,4.4600000000000004E-3,5.4999999999999997E-3,2.0100000000000001E-4,5.3399999999999997E-5,2.5399999999999999E-4,24.8,82.1,107,19.100000000000001,34.1,53.2,0.27200000000000002,0.79400000000000004,1.07]
["Enf03",2.38,5.79,8.17,1.95E-10,8.8699999999999994E-8,8.8899999999999995E-8,8.77E-3,2.5399999999999999E-2,3.4099999999999998E-2,1.5399999999999999E-3,3.5599999999999998E-3,5.11E-3,6.3299999999999999E-4,8.8900000000000003E-4,1.5200000000000001E-3,1.9000000000000001E-4,3.0200000000000002E-4,4.9200000000000003E-4,22.1,72.099999999999994,94.2,14.9,36.9,51.7,8.6699999999999999E-2,0.182,0.26900000000000002]
["Enf04",2.98,7.4,10.4,2.1899999999999999E-10,4.3800000000000002E-8,4.3999999999999997E-8,1.5800000000000002E-2,1.5800000000000002E-2,3.1600000000000003E-2,3.3600000000000001E-3,2.2100000000000002E-3,5.5700000000000003E-3,2.15E-3,5.3499999999999997E-3,7.4999999999999997E-3,1.8900000000000001E-4,9.7100000000000002E-5,2.8600000000000001E-4,28,80.3,108,28.9,33.1,62.1,0.82799999999999996,0.68799999999999994,1.52]
["Enf05",2.78,3.67,6.45,2.2300000000000001E-10,1.1300000000000001E-7,1.14E-7,1.12E-2,1.35E-2,2.47E-2,2.0999999999999999E-3,2.2399999999999998E-3,4.3400000000000001E-3,1.0200000000000001E-3,1.8400000000000001E-3,2.8500000000000001E-3,2.12E-4,8.5400000000000002E-5,2.9700000000000001E-4,25.9,41.5,67.400000000000006,19.5,34.1,53.6,0.248,0.32300000000000001,0.56999999999999995]
["Enf06",2.78,7.98,10.8,2.2300000000000001E-10,4.51E-8,4.5300000000000002E-8,1.12E-2,1.9300000000000001E-2,3.0499999999999999E-2,2.0999999999999999E-3,2.7100000000000002E-3,4.7999999999999996E-3,1.0200000000000001E-3,5.1000000000000004E-3,6.11E-3,2.12E-4,5.0899999999999997E-5,2.63E-4,25.9,91.4,117,19.5,35,54.4,0.248,0.65900000000000003,0.90700000000000003]
{"$rows_left_out":55}
{"sheet":"db_LCA80","index":4,"n_rows":62,"n_cols":28,"rows_kept":62,"cut":false,"hidden":true,"merged":[]}
["80år","GWP","kg CO2eq/m2/år",null,"ODP","kg R11-ækv/m2/år",null,"AP","kg SO2--ækv/m2/år",null,"EP","kg PO4--ækv/m2/år",null,"POCP","kg ethen--ækv/m2/år",null,"ADPe","kg Sb--ækv/m2/år",null,"ADPf","MJ/m2/år",null,"Petot","kWh/m2/år",null,"Sek","kWh/m2/år"]
[null,"Drift B6","Materialer A1-3, B4, C3-4","Alle faser\nA1-3, B4, B6, C3-4","Drift B6","Materialer A1-3, B4, C3-4","Alle faser\nA1-3, B4, B6, C3-4","Drift B6","Materialer A1-3, B4, C3-4","Alle faser\nA1-3, B4, B6, C3-4","Drift B6","Materialer A1-3, B4, C3-4","Alle faser\nA1-3, B4, B6, C3-4","Drift B6","Materialer A1-3, B4, C3-4","Alle faser\nA1-3, B4, B6, C3-4","Drift B6","Materialer A1-3, B4, C3-4","Alle faser\nA1-3, B4, B6, C3-4","Drift B6","Materialer A1-3, B4, C3-4","Alle faser\nA1-3, B4, B6, C3-4","Drift B6","Materialer A1-3, B4, C3-4","Alle faser\nA1-3, B4, B6, C3-4","Drift B6","Materialer A1-3, B4, C3-4","Alle faser\nA1-3, B4, B6, C3-4"]
["Enf01",2.82,4.95,7.77,2.2900000000000001E-10,2.6000000000000001E-8,2.62E-8,1.15E-2,1.4500000000000001E-2,2.5999999999999999E-2,2.2499999999999998E-3,1.7700000000000001E-3,4.0200000000000001E-3,1.14E-3,2.3400000000000001E-3,3.48E-3,2.1499999999999999E-4,5.1900000000000001E-5,2.6699999999999998E-4,25.9,50.4,76.3,21.5,19.899999999999999,41.5,0.41199999999999998,0.504,0.91700000000000004]
["Enf02",2.4500000000000002,5.19,7.64,2.01E-10,3.2299999999999998E-8,3.25E-8,9.4400000000000005E-3,1.2800000000000001E-2,2.2200000000000001E-2,1.8E-3,1.74E-3,3.5400000000000002E-3,8.4900000000000004E-4,2.96E-3,3.81E-3,1.92E-4,5.3900000000000002E-5,2.4600000000000002E-4,22.4,61.1,83.5,17.399999999999999,24.4,41.8,0.26800000000000002,0.496,0.76400000000000001]
["Enf03",2.21,4.5599999999999996,6.76,1.8500000000000001E-10,7.6500000000000003E-8,7.6700000000000005E-8,7.5199999999999998E-3,1.95E-2,2.7E-2,1.3600000000000001E-3,2.8400000000000001E-3,4.1999999999999997E-3,5.22E-4,9.59E-4,1.48E-3,1.8100000000000001E-4,2.02E-4,3.8299999999999999E-4,20.100000000000001,56.3,76.400000000000006,13.3,29.9,43.2,8.5800000000000001E-2,0.121,0.20699999999999999]
["Enf04",2.67,6.26,8.94,2.0800000000000001E-10,4.3800000000000002E-8,4.3999999999999997E-8,1.3599999999999999E-2,1.2699999999999999E-2,2.63E-2,2.8500000000000001E-3,1.82E-3,4.6699999999999997E-3,1.74E-3,3.6900000000000001E-3,5.4299999999999999E-3,1.8100000000000001E-4,6.8800000000000005E-5,2.4899999999999998E-4,24.7,67.900000000000006,92.6,26.8,28.7,55.4,0.81299999999999994,0.43,1.24]
["Enf05",2.56,3.11,5.67,2.11E-10,7.1499999999999998E-8,7.17E-8,9.6500000000000006E-3,1.11E-2,2.0799999999999999E-2,1.82E-3,1.72E-3,3.5400000000000002E-3,8.3100000000000003E-4,1.5E-3,2.33E-3,2.03E-4,7.1899999999999999E-5,2.7500000000000002E-4,23.5,35.799999999999997,59.3,17.600000000000001,25,42.6,0.24399999999999999,0.22700000000000001,0.47099999999999997]
["Enf06",2.56,5.82,8.3800000000000008,2.11E-10,4.36E-8,4.3800000000000002E-8,9.6500000000000006E-3,1.5299999999999999E-2,2.4899999999999999E-2,1.82E-3,2.1700000000000001E-3,3.9899999999999996E-3,8.3100000000000003E-4,3.5599999999999998E-3,4.3899999999999998E-3,2.03E-4,4.4499999999999997E-5,2.4699999999999999E-4,23.5,66.5,90,17.600000000000001,26.8,44.4,0.24399999999999999,0.45600000000000002,0.7]
{"$rows_left_out":55}
{"sheet":"diagram","index":5,"n_rows":43,"n_cols":24,"rows_kept":43,"cut":false,"hidden":true,"merged":[]}
[null,null,null,null,null,null,null,null,null,null,null,null,null,null,null,null,null,null,null,null,{"$f":"_xlfn.XLOOKUP($B$2,B$4:S$4,B5:S5)","v":3.11},{"$f":"A5","v":"minimum"},{"$f":"VLOOKUP(X1,U$1:V$6,2,FALSE)","v":"minimum"},{"$f":"SMALL(U:U,ROW(U1))","v":3.11}]
[null,{"$f":"category&\"\"&aar","v":"GWP80"},null,null,null,null,null,null,null,null,null,null,null,null,null,null,null,null,null,null,5.0774999999999997,"første kvartil",{"$f":"VLOOKUP(X2,U$1:V$6,2,FALSE)","v":"min bygning"},{"$f":"SMALL(U:U,ROW(U2))","v":4.4437447464635573}]
[null,null,null,null,null,null,null,null,null,null,null,null,null,null,null,null,null,null,null,null,5.7249999999999996,"median",{"$f":"VLOOKUP(X3,U$1:V$6,2,FALSE)","v":"første kvartil"},{"$f":"SMALL(U:U,ROW(U3))","v":5.0774999999999997}]
["navn","GWP50","GWP80","ODP50","ODP80","AP50","AP80","EP50","EP80","POCP50","POCP80","ADPf50","ADPf80","ADPe50","ADPe80","PEtot50","PEtot80","Sek50","Sek80",null,6.7824999999999998,"tredje kvartil",{"$f":"VLOOKUP(X4,U$1:V$6,2,FALSE)","v":"median"},{"$f":"SMALL(U:U,ROW(U4))","v":5.7249999999999996}]
["minimum",{"$f":"QUARTILE(INDIRECT(\"db_\"&B$4),0)","v":3.67},{"$f":"QUARTILE(INDIRECT(\"db_\"&C$4),0)","v":3.11},4.9200000000000004E-9,3.1399999999999999E-9,1.1299999999999999E-2,9.1800000000000007E-3,1.67E-3,1.2199999999999999E-3,8.8900000000000003E-4,9.4700000000000003E-4,41.5,33.1,3.6699999999999998E-5,3.04E-5,16.399999999999999,12,0.182,0.121,null,9.5,"maksimum",{"$f":"VLOOKUP(X5,U$1:V$6,2,FALSE)","v":"tredje kvartil"},{"$f":"SMALL(U:U,ROW(U5))","v":6.7824999999999998}]
["første kvartil",{"$f":"QUARTILE(INDIRECT(\"db_\"&B$4),1)","v":6.3049999999999997},{"$f":"QUARTILE(INDIRECT(\"db_\"&C$4),1)","v":5.0774999999999997},1.0474999999999999E-8,7.3674999999999996E-9,1.5775000000000001E-2,1.2775E-2,2.1450000000000002E-3,1.7174999999999998E-3,2.8024999999999999E-3,2.1975000000000002E-3,61.2,50.174999999999997,7.1750000000000009E-5,6.3349999999999995E-5,23.8,20.100000000000001,0.77925,0.49399999999999999,null,4.4437447464635573,"min bygning",{"$f":"IF(ISERROR(VLOOKUP(X6,U$1:V$6,2,FALSE)),\"-\",VLOOKUP(X6,U$1:V$6,2,FALSE))","v":"maksimum"},{"$f":"IF(ISERROR(SMALL(U:U,ROW(U6))),0,SMALL(U:U,ROW(U6)))","v":9.5}]
["median",{"$f":"QUARTILE(INDIRECT(\"db_\"&B$4),2)","v":7.0749999999999993},{"$f":"QUARTILE(INDIRECT(\"db_\"&C$4),2)","v":5.7249999999999996},2E-8,1.55E-8,1.7849999999999998E-2,1.52E-2,2.4099999999999998E-3,1.9750000000000002E-3,3.6099999999999999E-3,2.8600000000000001E-3,71.949999999999989,61.3,1.0449999999999999E-4,8.5799999999999998E-5,29.7,24.5,1.32,0.84699999999999998]
["tredje kvartil",{"$f":"QUARTILE(INDIRECT(\"db_\"&B$4),3)","v":8.5224999999999991},{"$f":"QUARTILE(INDIRECT(\"db_\"&C$4),3)","v":6.7824999999999998},4.88E-8,4.1575E-8,2.2100000000000002E-2,1.8974999999999999E-2,2.8425E-3,2.3675000000000002E-3,5.13E-3,3.7000000000000002E-3,86.024999999999991,71.775000000000006,1.8525E-4,1.6799999999999999E-4,35.524999999999999,29.200000000000003,1.7324999999999999,1.1000000000000001]
{"$rows_left_out":36}
{"sheet":"menuer","index":6,"n_rows":27,"n_cols":13,"rows_kept":27,"cut":false,"hidden":true,"merged":[]}
["menuer",1]
[]
[]
[]
["vælg tilstand",null,"vælg materialet",null,"GWP",null,null,null,null,"GWP","CO2eq ","kg","tons"]
["god",null,"beton/cement",null,"GWP samlet [tons]",null,50,null,null,"ODP","R11eq ","kg","tons"]
["middel",null,"træ",null,"GWP / m2 [kg]",null,80,null,null,"AP","SO2eq","kg","tons"]
["under middel",null,"metal",null,null,null,null,null,null,"EP","PO4eq","kg","tons"]
{"$rows_left_out":20}
{"sheet":"beregning","index":7,"n_rows":15,"n_cols":29,"rows_kept":15,"cut":false,"hidden":true,"merged":[]}
[]
[]
[null,null,null,null,null,null,null,null,null,null,null,null,null,null,null,null,null,null,null,null,null,null,null,null,null,"bedst match"]
[null,null,null,null,null,null,null,null,null,null,null,null,null,null,null,null,null,null,null,null,null,null,null,null,null,{"$f":"C7","v":"E07"}]
[null,null,null,null,null,null,null,null,null,null,null,null,null,null,null,null,null,null,null,null,"resultat","tons","tons","tons",null,"resultat","tons","tons","tons"]
[null,null,"match 1","match 1 - score","match 2","match 2 - score","match 3","match 3 - score",null,"varians",null,null,1,"faktor",2,"faktor",3,"faktor",null,null,"/m2 a",{"$f":"\"/m2/\"&aar&\" år\"","v":"/m2/80 år"},"per år","total",null,"/m2 a",{"$f":"\"/m2/\"&aar&\" år\"","v":"/m2/80 år"},"per år","total"]
[null,null,"E07",100.09999847412109,"Enf03",70.900001525878906,"R09",67.199996948242188,"alle",{"$f":"SQRT((300-(D8+F8+H8))/300)","v":0.45423929642821126},{"$f":"_xlfn.VAR.S(M7,O7,Q7)","v":0.5477333333333263},{"$f":"T7","v":"GWP"},{"$f":"_xlfn.XLOOKUP(C$7,db_names,INDIRECT(\"db_\"&$L7&\"\"&aar),\"\")","v":3.8},{"$f":"M7*($D$7)","v":380.37999420166011},{"$f":"_xlfn.XLOOKUP(E$7,db_names,INDIRECT(\"db_\"&$L7&\"\"&aar),\"\")","v":4.5599999999999996},{"$f":"O7*($F$7)","v":323.30400695800779},{"$f":"_xlfn.XLOOKUP(G$7,db_names,INDIRECT(\"db_\"&$L7&\"\"&aar),\"\")","v":5.28},{"$f":"Q7*$H$7","v":354.81598388671875},null,{"$f":"menuer!J5","v":"GWP"},{"$f":"IF(M7>0,IF(ISERROR((N7+P7+R7)/(D$7+F$7+H$7)),\"-\",(N7+P7+R7)/(D$7+F$7+H$7)),0)","v":4.4437447464635573},{"$f":"IF(ISERROR(U7*aar/1000),\"-\",U7*aar/1000)","v":0.35549957971708462},{"$f":"IF(ISERROR(U7*areal/1000),\"-\",U7*areal/1000)","v":13.331234239390673},{"$f":"IF(ISERROR(U7*aar*areal/1000),\"-\",U7*aar*areal/1000)","v":1066.4987391512539},null,{"$f":"IF(ISERROR(M7),\"-\",M7)","v":3.8},{"$f":"IF(ISERROR(Z7*aar/1000),\"-\",Z7*aar/1000)","v":0.30399999999999999},{"$f":"IF(ISERROR(Z7*areal/1000),\"-\",Z7*areal/1000)","v":11.4},{"$f":"IF(ISERROR(Z7*aar*areal/1000),\"-\",Z7*aar*areal/1000)","v":912}]
[null,null,null,{"$f":"IF(D7>100,100,D7)","v":100},null,{"$f":"IF(F7>100,100,F7)","v":70.900001525878906},null,{"$f":"IF(H7>100,100,H7)","v":67.199996948242188},{"$f":"C7","v":"E07"},{"$f":"1-D8/100","v":0},null,"ODP",{"$f":"_xlfn.XLOOKUP(C$7,db_names,INDIRECT(\"db_\"&L8&\"\"&aar),\"\")","v":7.3799999999999999E-8},7.3873798873901368E-6,{"$f":"_xlfn.XLOOKUP(E$7,db_names,INDIRECT(\"db_\"&$L8&\"\"&aar),\"\")","v":7.6500000000000003E-8},5.4238501167297364E-6,{"$f":"_xlfn.XLOOKUP(G$7,db_names,INDIRECT(\"db_\"&$L8&\"\"&aar),\"\")","v":4.0900000000000002E-8},2.7484798751831056E-6,null,{"$f":"menuer!J6","v":"ODP"},{"$f":"IF(M8>0,IF(ISERROR((N8+P8+R8)/(D$7+F$7+H$7)),\"-\",(N8+P8+R8)/(D$7+F$7+H$7)),0)","v":6.5322040632451835E-8},5.2257632505961463E-9,1.959661218973555E-7,1.5677289751788439E-5,null,{"$f":"IF(ISERROR(M8),\"-\",M8)","v":7.3799999999999999E-8},5.9039999999999995E-9,2.2139999999999998E-7,1.7711999999999999E-5]
{"$rows_left_out":8}
{"sheet":"andel bygningsdele","index":8,"n_rows":15,"n_cols":7,"rows_kept":15,"cut":false,"hidden":true,"merged":[]}
[]
[]
[]
[]
[null,null,null,"fundament",0.5,{"$f":"E5/E$15","v":8.1967213114754106E-2},{"$f":"ROUND(F5*100,0)","v":8}]
[null,null,null,"terrændæk",0.5,8.1967213114754106E-2,{"$f":"ROUND(F6*100,0)","v":8}]
[null,null,null,"dæk",1.4,0.22950819672131148,23]
[null,null,null,"ydervægge",0.7,0.11475409836065574,11]
{"$rows_left_out":7}